Build failed in Jenkins: pgadmin4-master-python26 #953

classic Classic list List threaded Threaded
7 messages Options
Reply | Threaded
Open this post in threaded view
|

Build failed in Jenkins: pgadmin4-master-python26 #953

pgAdmin 4 Jenkins
See <https://jenkins.pgadmin.org/job/pgadmin4-master-python26/953/display/redirect?page=changes>

Changes:

[Dave Page] Fix an encoding issue in the query tool. Fixes #3711

[Dave Page] Update release notes.

------------------------------------------
[...truncated 4.29 KB...]
  Cache entry deserialization failed, entry ignored
<https://jenkins.pgadmin.org/job/pgadmin4-master-python26/ws/pgadmin-venv/lib/python2.6/site-packages/pip/_vendor/urllib3/util/ssl_.py>:339: SNIMissingWarning: An HTTPS request has been made, but the SNI (Subject Name Indication) extension to TLS is not available on this platform. This may cause the server to present an incorrect TLS certificate, which can cause validation failures. You can upgrade to a newer version of Python to solve this. For more information, see https://urllib3.readthedocs.io/en/latest/advanced-usage.html#ssl-warnings
  SNIMissingWarning
<https://jenkins.pgadmin.org/job/pgadmin4-master-python26/ws/pgadmin-venv/lib/python2.6/site-packages/pip/_vendor/urllib3/util/ssl_.py>:137: InsecurePlatformWarning: A true SSLContext object is not available. This prevents urllib3 from configuring SSL appropriately and may cause certain SSL connections to fail. You can upgrade to a newer version of Python to solve this. For more information, see https://urllib3.readthedocs.io/en/latest/advanced-usage.html#ssl-warnings
  InsecurePlatformWarning
Collecting extras==1.0.0 (from -r requirements.txt (line 7))
  Cache entry deserialization failed, entry ignored
  Using cached https://files.pythonhosted.org/packages/03/e9/e915af1f97914cd0bc021e125fd1bfd4106de614a275e4b6866dd9a209ac/extras-1.0.0-py2.py3-none-any.whl
Collecting fixtures==3.0.0 (from -r requirements.txt (line 8))
  Cache entry deserialization failed, entry ignored
  Using cached https://files.pythonhosted.org/packages/a8/28/7eed6bf76792f418029a18d5b2ace87ce7562927cdd00f1cefe481cd148f/fixtures-3.0.0-py2.py3-none-any.whl
Collecting Flask==0.12.4 (from -r requirements.txt (line 9))
  Cache entry deserialization failed, entry ignored
  Using cached https://files.pythonhosted.org/packages/2e/48/f1936dadac2326b3d73f2fe0a964a87d16be16eb9d7fc56f09c1bea3d17c/Flask-0.12.4-py2.py3-none-any.whl
Collecting Flask-Gravatar==0.5.0 (from -r requirements.txt (line 10))
  Cache entry deserialization failed, entry ignored
  Using cached https://files.pythonhosted.org/packages/58/4a/b20260e8d383d0037f2791dd8a3f3ea729ca9f02d7638677a34a236a8702/Flask_Gravatar-0.5.0-py2.py3-none-any.whl
Collecting Flask-Login==0.3.2 (from -r requirements.txt (line 11))
  Cache entry deserialization failed, entry ignored
Collecting Flask-Mail==0.9.1 (from -r requirements.txt (line 12))
  Cache entry deserialization failed, entry ignored
Collecting Flask-Migrate==2.1.1 (from -r requirements.txt (line 13))
  Cache entry deserialization failed, entry ignored
  Using cached https://files.pythonhosted.org/packages/c6/06/053630cb5fe3974c7d60c2d3f3907bae6ff86beb8720bd4fcf53c45c6702/Flask_Migrate-2.1.1-py2.py3-none-any.whl
Collecting Flask-Principal==0.4.0 (from -r requirements.txt (line 14))
  Cache entry deserialization failed, entry ignored
Collecting Flask-SQLAlchemy==2.3.2 (from -r requirements.txt (line 15))
  Cache entry deserialization failed, entry ignored
  Using cached https://files.pythonhosted.org/packages/a1/44/294fb7f6bf49cc7224417cd0637018db9fee0729b4fe166e43e2bbb1f1c8/Flask_SQLAlchemy-2.3.2-py2.py3-none-any.whl
Collecting Flask-WTF==0.14.2 (from -r requirements.txt (line 16))
  Cache entry deserialization failed, entry ignored
  Using cached https://files.pythonhosted.org/packages/60/3a/58c629472d10539ae5167dc7c1fecfa95dd7d0b7864623931e3776438a24/Flask_WTF-0.14.2-py2.py3-none-any.whl
Collecting html5lib==1.0.1 (from -r requirements.txt (line 17))
  Cache entry deserialization failed, entry ignored
  Using cached https://files.pythonhosted.org/packages/a5/62/bbd2be0e7943ec8504b517e62bab011b4946e1258842bc159e5dfde15b96/html5lib-1.0.1-py2.py3-none-any.whl
Collecting linecache2==1.0.0 (from -r requirements.txt (line 18))
  Cache entry deserialization failed, entry ignored
  Using cached https://files.pythonhosted.org/packages/c7/a3/c5da2a44c85bfbb6eebcfc1dde24933f8704441b98fdde6528f4831757a6/linecache2-1.0.0-py2.py3-none-any.whl
Collecting passlib==1.7.1 (from -r requirements.txt (line 19))
  Cache entry deserialization failed, entry ignored
  Using cached https://files.pythonhosted.org/packages/ee/a7/d6d238d927df355d4e4e000670342ca4705a72f0bf694027cf67d9bcf5af/passlib-1.7.1-py2.py3-none-any.whl
Collecting pbr==3.1.1 (from -r requirements.txt (line 20))
  Cache entry deserialization failed, entry ignored
  Using cached https://files.pythonhosted.org/packages/0c/5d/b077dbf309993d52c1d71e6bf6fe443a8029ea215135ebbe0b1b10e7aefc/pbr-3.1.1-py2.py3-none-any.whl
Collecting pycrypto>=2.6.1 (from -r requirements.txt (line 21))
  Cache entry deserialization failed, entry ignored
Collecting pyrsistent==0.14.2 (from -r requirements.txt (line 22))
  Cache entry deserialization failed, entry ignored
Collecting python-mimeparse==1.6.0 (from -r requirements.txt (line 23))
  Cache entry deserialization failed, entry ignored
  Using cached https://files.pythonhosted.org/packages/26/2e/03bce213a9bf02a2750dcb04e761785e9c763fc11071edc4b447eacbb842/python_mimeparse-1.6.0-py2.py3-none-any.whl
Collecting pytz==2018.3 (from -r requirements.txt (line 24))
  Cache entry deserialization failed, entry ignored
  Using cached https://files.pythonhosted.org/packages/3c/80/32e98784a8647880dedf1f6bf8e2c91b195fe18fdecc6767dcf5104598d6/pytz-2018.3-py2.py3-none-any.whl
Collecting simplejson==3.13.2 (from -r requirements.txt (line 25))
  Cache entry deserialization failed, entry ignored
Collecting six>=1.11.0 (from -r requirements.txt (line 26))
  Cache entry deserialization failed, entry ignored
  Using cached https://files.pythonhosted.org/packages/67/4b/141a581104b1f6397bfa78ac9d43d8ad29a7ca43ea90a2d863fe3056e86a/six-1.11.0-py2.py3-none-any.whl
Collecting speaklater==1.3 (from -r requirements.txt (line 27))
  Cache entry deserialization failed, entry ignored
Collecting sqlparse==0.2.4 (from -r requirements.txt (line 28))
  Cache entry deserialization failed, entry ignored
  Using cached https://files.pythonhosted.org/packages/65/85/20bdd72f4537cf2c4d5d005368d502b2f464ede22982e724a82c86268eda/sqlparse-0.2.4-py2.py3-none-any.whl
Collecting WTForms==2.1 (from -r requirements.txt (line 29))
  Cache entry deserialization failed, entry ignored
Collecting Flask-Paranoid==0.2.0 (from -r requirements.txt (line 30))
  Cache entry deserialization failed, entry ignored
  Using cached https://files.pythonhosted.org/packages/0e/14/359033a218c5403872e11ff7267e6c638c0279067fa932d93653188f4052/Flask_Paranoid-0.2.0-py2.py3-none-any.whl
Collecting psutil==5.4.7 (from -r requirements.txt (line 31))
  Cache entry deserialization failed, entry ignored
Collecting backports.csv==1.0.5 (from -r requirements.txt (line 47))
  Cache entry deserialization failed, entry ignored
  Using cached https://files.pythonhosted.org/packages/23/01/0b1fce3fd8199fe32338dc66747baad52c7183b7f587128bc77cefde0620/backports.csv-1.0.5-py2.py3-none-any.whl
Collecting importlib==1.0.3 (from -r requirements.txt (line 48))
  Cache entry deserialization failed, entry ignored
Collecting psycopg2==2.7.3.2 (from -r requirements.txt (line 53))
  Cache entry deserialization failed, entry ignored
  Using cached https://files.pythonhosted.org/packages/a7/4a/82ec8b785ab96f7ff0f1029ff5bd962fbf1775a3b57e613800bd6c311ed7/psycopg2-2.7.3.2-cp26-cp26m-manylinux1_x86_64.whl
Collecting Flask-Script==2.0.5 (from -r requirements.txt (line 54))
Collecting ordereddict (from -r requirements.txt (line 55))
Collecting python-dateutil==2.5.0 (from -r requirements.txt (line 56))
  Cache entry deserialization failed, entry ignored
  Using cached https://files.pythonhosted.org/packages/b2/2c/1e76d08cbfb4d81faa4ab9995ed5d3ac45bd380da32df1733530dfdd8123/python_dateutil-2.5.0-py2.py3-none-any.whl
Collecting SQLAlchemy==1.0.14 (from -r requirements.txt (line 57))
  Cache entry deserialization failed, entry ignored
Collecting Flask-Security==1.7.5 (from -r requirements.txt (line 58))
  Cache entry deserialization failed, entry ignored
Collecting Flask-BabelEx==0.9.3 (from -r requirements.txt (line 59))
  Cache entry deserialization failed, entry ignored
Collecting testtools>=0.9.22 (from fixtures==3.0.0->-r requirements.txt (line 8))
  Cache entry deserialization failed, entry ignored
  Using cached https://files.pythonhosted.org/packages/87/74/a4d55da28d7bba6d6f49430f22a62afd8472cb24a63fa61daef80d3e821b/testtools-2.3.0-py2.py3-none-any.whl
Collecting click>=2.0 (from Flask==0.12.4->-r requirements.txt (line 9))
  Cache entry deserialization failed, entry ignored
  Using cached https://files.pythonhosted.org/packages/34/c1/8806f99713ddb993c5366c362b2f908f18269f8d792aff1abfd700775a77/click-6.7-py2.py3-none-any.whl
Collecting Jinja2>=2.4 (from Flask==0.12.4->-r requirements.txt (line 9))
  Cache entry deserialization failed, entry ignored
  Using cached https://files.pythonhosted.org/packages/7f/ff/ae64bacdfc95f27a016a7bed8e8686763ba4d277a78ca76f32659220a731/Jinja2-2.10-py2.py3-none-any.whl
Collecting Werkzeug>=0.7 (from Flask==0.12.4->-r requirements.txt (line 9))
  Cache entry deserialization failed, entry ignored
  Using cached https://files.pythonhosted.org/packages/20/c4/12e3e56473e52375aa29c4764e70d1b8f3efa6682bef8d0aae04fe335243/Werkzeug-0.14.1-py2.py3-none-any.whl
Collecting itsdangerous>=0.21 (from Flask==0.12.4->-r requirements.txt (line 9))
  Cache entry deserialization failed, entry ignored
Collecting alembic>=0.6 (from Flask-Migrate==2.1.1->-r requirements.txt (line 13))
  Cache entry deserialization failed, entry ignored
Collecting webencodings (from html5lib==1.0.1->-r requirements.txt (line 17))
  Cache entry deserialization failed, entry ignored
  Using cached https://files.pythonhosted.org/packages/f4/24/2a3e3df732393fed8b3ebf2ec078f05546de641fe1b667ee316ec1dcf3b7/webencodings-0.5.1-py2.py3-none-any.whl
Collecting Babel>=1.0 (from Flask-BabelEx==0.9.3->-r requirements.txt (line 59))
  Cache entry deserialization failed, entry ignored
  Using cached https://files.pythonhosted.org/packages/94/03/14e68ad12e771a79cf96792f7158d68a7b3d8c7b2badf39e9ef1f65b57d6/Babel-2.5.3-py2.py3-none-any.whl
Collecting unittest2>=1.0.0 (from testtools>=0.9.22->fixtures==3.0.0->-r requirements.txt (line 8))
  Cache entry deserialization failed, entry ignored
  Using cached https://files.pythonhosted.org/packages/72/20/7f0f433060a962200b7272b8c12ba90ef5b903e218174301d0abfd523813/unittest2-1.1.0-py2.py3-none-any.whl
Collecting traceback2 (from testtools>=0.9.22->fixtures==3.0.0->-r requirements.txt (line 8))
  Cache entry deserialization failed, entry ignored
  Using cached https://files.pythonhosted.org/packages/17/0a/6ac05a3723017a967193456a2efa0aa9ac4b51456891af1e2353bb9de21e/traceback2-1.4.0-py2.py3-none-any.whl
Collecting MarkupSafe>=0.23 (from Jinja2>=2.4->Flask==0.12.4->-r requirements.txt (line 9))
  Cache entry deserialization failed, entry ignored
Collecting Mako (from alembic>=0.6->Flask-Migrate==2.1.1->-r requirements.txt (line 13))
  Cache entry deserialization failed, entry ignored
Collecting python-editor>=0.3 (from alembic>=0.6->Flask-Migrate==2.1.1->-r requirements.txt (line 13))
  Cache entry deserialization failed, entry ignored
Requirement already satisfied: argparse in ./pgadmin-venv/lib/python2.6/site-packages (from unittest2>=1.0.0->testtools>=0.9.22->fixtures==3.0.0->-r requirements.txt (line 8))
Installing collected packages: blinker, extras, six, python-mimeparse, linecache2, traceback2, unittest2, pbr, testtools, fixtures, click, MarkupSafe, Jinja2, Werkzeug, itsdangerous, Flask, Flask-Gravatar, Flask-Login, Flask-Mail, python-dateutil, SQLAlchemy, Mako, python-editor, alembic, Flask-SQLAlchemy, Flask-Migrate, Flask-Principal, ordereddict, WTForms, Flask-WTF, webencodings, html5lib, passlib, pycrypto, pyrsistent, pytz, simplejson, speaklater, sqlparse, Flask-Paranoid, psutil, backports.csv, importlib, psycopg2, Flask-Script, Flask-Security, Babel, Flask-BabelEx
Successfully installed Babel-2.5.3 Flask-0.12.4 Flask-BabelEx-0.9.3 Flask-Gravatar-0.5.0 Flask-Login-0.3.2 Flask-Mail-0.9.1 Flask-Migrate-2.1.1 Flask-Paranoid-0.2.0 Flask-Principal-0.4.0 Flask-SQLAlchemy-2.3.2 Flask-Script-2.0.5 Flask-Security-1.7.5 Flask-WTF-0.14.2 Jinja2-2.10 Mako-1.0.7 MarkupSafe-1.0 SQLAlchemy-1.0.14 WTForms-2.1 Werkzeug-0.14.1 alembic-0.9.10 backports.csv-1.0.5 blinker-1.4 click-6.7 extras-1.0.0 fixtures-3.0.0 html5lib-1.0.1 importlib-1.0.3 itsdangerous-0.24 linecache2-1.0.0 ordereddict-1.1 passlib-1.7.1 pbr-3.1.1 psutil-5.4.7 psycopg2-2.7.3.2 pycrypto-2.6.1 pyrsistent-0.14.2 python-dateutil-2.5.0 python-editor-1.0.3 python-mimeparse-1.6.0 pytz-2018.3 simplejson-3.13.2 six-1.11.0 speaklater-1.3 sqlparse-0.2.4 testtools-2.3.0 traceback2-1.4.0 unittest2-1.1.0 webencodings-0.5.1
You are using pip version 9.0.3, however version 18.1 is available.
You should consider upgrading via the 'pip install --upgrade pip' command.
DEPRECATION: Python 2.6 is no longer supported by the Python core team, please upgrade your Python. A future version of pip will drop support for Python 2.6
Ignoring psycopg2: markers 'python_version >= "2.7"' don't match your environment
Ignoring python-dateutil: markers 'python_version >= "2.7"' don't match your environment
Ignoring htmlmin: markers 'python_version >= "2.7"' don't match your environment
Ignoring Flask-HTMLmin: markers 'python_version >= "2.7"' don't match your environment
Ignoring SQLAlchemy: markers 'python_version >= "2.7"' don't match your environment
Ignoring Flask-Security: markers 'python_version >= "2.7"' don't match your environment
Ignoring sshtunnel: markers 'python_version >= "2.7"' don't match your environment
Ignoring selenium: markers 'python_version >= "2.7"' don't match your environment
<https://jenkins.pgadmin.org/job/pgadmin4-master-python26/ws/pgadmin-venv/lib/python2.6/site-packages/pip/req/req_file.py>:150: UserWarning: Disabling all use of wheels due to the use of --build-options / --global-options / --install-options.
  cmdoptions.check_install_build_global(options, opts)
Requirement already satisfied: blinker==1.4 in ./pgadmin-venv/lib/python2.6/site-packages (from -r web/regression/../../requirements.txt (line 6))
Requirement already satisfied: extras==1.0.0 in ./pgadmin-venv/lib/python2.6/site-packages (from -r web/regression/../../requirements.txt (line 7))
Requirement already satisfied: fixtures==3.0.0 in ./pgadmin-venv/lib/python2.6/site-packages (from -r web/regression/../../requirements.txt (line 8))
Requirement already satisfied: Flask==0.12.4 in ./pgadmin-venv/lib/python2.6/site-packages (from -r web/regression/../../requirements.txt (line 9))
Requirement already satisfied: Flask-Gravatar==0.5.0 in ./pgadmin-venv/lib/python2.6/site-packages (from -r web/regression/../../requirements.txt (line 10))
Requirement already satisfied: Flask-Login==0.3.2 in ./pgadmin-venv/lib/python2.6/site-packages (from -r web/regression/../../requirements.txt (line 11))
Requirement already satisfied: Flask-Mail==0.9.1 in ./pgadmin-venv/lib/python2.6/site-packages (from -r web/regression/../../requirements.txt (line 12))
Requirement already satisfied: Flask-Migrate==2.1.1 in ./pgadmin-venv/lib/python2.6/site-packages (from -r web/regression/../../requirements.txt (line 13))
Requirement already satisfied: Flask-Principal==0.4.0 in ./pgadmin-venv/lib/python2.6/site-packages (from -r web/regression/../../requirements.txt (line 14))
Requirement already satisfied: Flask-SQLAlchemy==2.3.2 in ./pgadmin-venv/lib/python2.6/site-packages (from -r web/regression/../../requirements.txt (line 15))
Requirement already satisfied: Flask-WTF==0.14.2 in ./pgadmin-venv/lib/python2.6/site-packages (from -r web/regression/../../requirements.txt (line 16))
Requirement already satisfied: html5lib==1.0.1 in ./pgadmin-venv/lib/python2.6/site-packages (from -r web/regression/../../requirements.txt (line 17))
Requirement already satisfied: linecache2==1.0.0 in ./pgadmin-venv/lib/python2.6/site-packages (from -r web/regression/../../requirements.txt (line 18))
Requirement already satisfied: passlib==1.7.1 in ./pgadmin-venv/lib/python2.6/site-packages (from -r web/regression/../../requirements.txt (line 19))
Requirement already satisfied: pbr==3.1.1 in ./pgadmin-venv/lib/python2.6/site-packages (from -r web/regression/../../requirements.txt (line 20))
Requirement already satisfied: pycrypto>=2.6.1 in ./pgadmin-venv/lib/python2.6/site-packages (from -r web/regression/../../requirements.txt (line 21))
Requirement already satisfied: pyrsistent==0.14.2 in ./pgadmin-venv/lib/python2.6/site-packages (from -r web/regression/../../requirements.txt (line 22))
Requirement already satisfied: python-mimeparse==1.6.0 in ./pgadmin-venv/lib/python2.6/site-packages (from -r web/regression/../../requirements.txt (line 23))
Requirement already satisfied: pytz==2018.3 in ./pgadmin-venv/lib/python2.6/site-packages (from -r web/regression/../../requirements.txt (line 24))
Requirement already satisfied: simplejson==3.13.2 in ./pgadmin-venv/lib/python2.6/site-packages (from -r web/regression/../../requirements.txt (line 25))
Requirement already satisfied: six>=1.11.0 in ./pgadmin-venv/lib/python2.6/site-packages (from -r web/regression/../../requirements.txt (line 26))
Requirement already satisfied: speaklater==1.3 in ./pgadmin-venv/lib/python2.6/site-packages (from -r web/regression/../../requirements.txt (line 27))
Requirement already satisfied: sqlparse==0.2.4 in ./pgadmin-venv/lib/python2.6/site-packages (from -r web/regression/../../requirements.txt (line 28))
Requirement already satisfied: WTForms==2.1 in ./pgadmin-venv/lib/python2.6/site-packages (from -r web/regression/../../requirements.txt (line 29))
Requirement already satisfied: Flask-Paranoid==0.2.0 in ./pgadmin-venv/lib/python2.6/site-packages (from -r web/regression/../../requirements.txt (line 30))
Requirement already satisfied: psutil==5.4.7 in ./pgadmin-venv/lib/python2.6/site-packages (from -r web/regression/../../requirements.txt (line 31))
Requirement already satisfied: backports.csv==1.0.5 in ./pgadmin-venv/lib/python2.6/site-packages (from -r web/regression/../../requirements.txt (line 47))
Requirement already satisfied: importlib==1.0.3 in ./pgadmin-venv/lib/python2.6/site-packages (from -r web/regression/../../requirements.txt (line 48))
Requirement already satisfied: psycopg2==2.7.3.2 in ./pgadmin-venv/lib/python2.6/site-packages (from -r web/regression/../../requirements.txt (line 53))
Requirement already satisfied: Flask-Script==2.0.5 in ./pgadmin-venv/lib/python2.6/site-packages (from -r web/regression/../../requirements.txt (line 54))
Requirement already satisfied: ordereddict in ./pgadmin-venv/lib/python2.6/site-packages (from -r web/regression/../../requirements.txt (line 55))
Requirement already satisfied: python-dateutil==2.5.0 in ./pgadmin-venv/lib/python2.6/site-packages (from -r web/regression/../../requirements.txt (line 56))
Requirement already satisfied: SQLAlchemy==1.0.14 in ./pgadmin-venv/lib/python2.6/site-packages (from -r web/regression/../../requirements.txt (line 57))
Requirement already satisfied: Flask-Security==1.7.5 in ./pgadmin-venv/lib/python2.6/site-packages (from -r web/regression/../../requirements.txt (line 58))
Requirement already satisfied: Flask-BabelEx==0.9.3 in ./pgadmin-venv/lib/python2.6/site-packages (from -r web/regression/../../requirements.txt (line 59))
Collecting pycodestyle==2.3.1 (from -r web/regression/requirements.txt (line 9))
  Cache entry deserialization failed, entry ignored
<https://jenkins.pgadmin.org/job/pgadmin4-master-python26/ws/pgadmin-venv/lib/python2.6/site-packages/pip/_vendor/urllib3/util/ssl_.py>:339: SNIMissingWarning: An HTTPS request has been made, but the SNI (Subject Name Indication) extension to TLS is not available on this platform. This may cause the server to present an incorrect TLS certificate, which can cause validation failures. You can upgrade to a newer version of Python to solve this. For more information, see https://urllib3.readthedocs.io/en/latest/advanced-usage.html#ssl-warnings
  SNIMissingWarning
<https://jenkins.pgadmin.org/job/pgadmin4-master-python26/ws/pgadmin-venv/lib/python2.6/site-packages/pip/_vendor/urllib3/util/ssl_.py>:137: InsecurePlatformWarning: A true SSLContext object is not available. This prevents urllib3 from configuring SSL appropriately and may cause certain SSL connections to fail. You can upgrade to a newer version of Python to solve this. For more information, see https://urllib3.readthedocs.io/en/latest/advanced-usage.html#ssl-warnings
  InsecurePlatformWarning
  Using cached https://files.pythonhosted.org/packages/e1/88/0e2cbf412bd849ea6f1af1f97882add46a374f4ba1d2aea39353609150ad/pycodestyle-2.3.1.tar.gz
Collecting pyperclip~=1.6.0 (from -r web/regression/requirements.txt (line 10))
  Cache entry deserialization failed, entry ignored
  Using cached https://files.pythonhosted.org/packages/80/a4/7c65c8fb16787d74f720dfb1dee4227a65058f268e91014e24fd76b18f8b/pyperclip-1.6.5.tar.gz
Collecting testscenarios==0.5.0 (from -r web/regression/requirements.txt (line 11))
  Cache entry deserialization failed, entry ignored
  Using cached https://files.pythonhosted.org/packages/f0/de/b0b5b98c0f38fd7086d082c47fcb455eedd39a044abe7c595f5f40cd6eed/testscenarios-0.5.0.tar.gz
Requirement already satisfied: testtools==2.3.0 in ./pgadmin-venv/lib/python2.6/site-packages (from -r web/regression/requirements.txt (line 12))
Requirement already satisfied: traceback2==1.4.0 in ./pgadmin-venv/lib/python2.6/site-packages (from -r web/regression/requirements.txt (line 13))
Requirement already satisfied: unittest2==1.1.0 in ./pgadmin-venv/lib/python2.6/site-packages (from -r web/regression/requirements.txt (line 14))
Collecting selenium==3.3.3 (from -r web/regression/requirements.txt (line 24))
  Cache entry deserialization failed, entry ignored
  Using cached https://files.pythonhosted.org/packages/0c/2d/6c51aceb5ad1f9fa75edc7dd47062af19ae79fe49b70ad0089060fb7ac69/selenium-3.3.3.tar.gz
Collecting mock===2.0.0 (from -r web/regression/requirements.txt (line 29))
  Cache entry deserialization failed, entry ignored
  Using cached https://files.pythonhosted.org/packages/0c/53/014354fc93c591ccc4abff12c473ad565a2eb24dcd82490fae33dbf2539f/mock-2.0.0.tar.gz
Collecting chromedriver_installer==0.0.6 (from -r web/regression/requirements.txt (line 33))
  Cache entry deserialization failed, entry ignored
  Using cached https://files.pythonhosted.org/packages/c8/01/0a8a725bb605f68923aba16099a01cbbfe547c8b7dc96fd9a554424f6524/chromedriver_installer-0.0.6.tar.gz
Requirement already satisfied: click>=2.0 in ./pgadmin-venv/lib/python2.6/site-packages (from Flask==0.12.4->-r web/regression/../../requirements.txt (line 9))
Requirement already satisfied: Jinja2>=2.4 in ./pgadmin-venv/lib/python2.6/site-packages (from Flask==0.12.4->-r web/regression/../../requirements.txt (line 9))
Requirement already satisfied: Werkzeug>=0.7 in ./pgadmin-venv/lib/python2.6/site-packages (from Flask==0.12.4->-r web/regression/../../requirements.txt (line 9))
Requirement already satisfied: itsdangerous>=0.21 in ./pgadmin-venv/lib/python2.6/site-packages (from Flask==0.12.4->-r web/regression/../../requirements.txt (line 9))
Requirement already satisfied: alembic>=0.6 in ./pgadmin-venv/lib/python2.6/site-packages (from Flask-Migrate==2.1.1->-r web/regression/../../requirements.txt (line 13))
Requirement already satisfied: webencodings in ./pgadmin-venv/lib/python2.6/site-packages (from html5lib==1.0.1->-r web/regression/../../requirements.txt (line 17))
Requirement already satisfied: Babel>=1.0 in ./pgadmin-venv/lib/python2.6/site-packages (from Flask-BabelEx==0.9.3->-r web/regression/../../requirements.txt (line 59))
Requirement already satisfied: argparse in ./pgadmin-venv/lib/python2.6/site-packages (from unittest2==1.1.0->-r web/regression/requirements.txt (line 14))
Collecting funcsigs>=1 (from mock===2.0.0->-r web/regression/requirements.txt (line 29))
  Cache entry deserialization failed, entry ignored
  Using cached https://files.pythonhosted.org/packages/94/4a/db842e7a0545de1cdb0439bb80e6e42dfe82aaeaadd4072f2263a4fbed23/funcsigs-1.0.2.tar.gz
Requirement already satisfied: MarkupSafe>=0.23 in ./pgadmin-venv/lib/python2.6/site-packages (from Jinja2>=2.4->Flask==0.12.4->-r web/regression/../../requirements.txt (line 9))
Requirement already satisfied: Mako in ./pgadmin-venv/lib/python2.6/site-packages (from alembic>=0.6->Flask-Migrate==2.1.1->-r web/regression/../../requirements.txt (line 13))
Requirement already satisfied: python-editor>=0.3 in ./pgadmin-venv/lib/python2.6/site-packages (from alembic>=0.6->Flask-Migrate==2.1.1->-r web/regression/../../requirements.txt (line 13))
Skipping bdist_wheel for pycodestyle, due to binaries being disabled for it.
Skipping bdist_wheel for pyperclip, due to binaries being disabled for it.
Skipping bdist_wheel for testscenarios, due to binaries being disabled for it.
Skipping bdist_wheel for selenium, due to binaries being disabled for it.
Skipping bdist_wheel for mock, due to binaries being disabled for it.
Skipping bdist_wheel for chromedriver-installer, due to binaries being disabled for it.
Skipping bdist_wheel for funcsigs, due to binaries being disabled for it.
Installing collected packages: pycodestyle, pyperclip, testscenarios, selenium, funcsigs, mock, chromedriver-installer
  Running setup.py install for pycodestyle: started
    Running setup.py install for pycodestyle: finished with status 'done'
  Running setup.py install for pyperclip: started
    Running setup.py install for pyperclip: finished with status 'done'
  Running setup.py install for testscenarios: started
    Running setup.py install for testscenarios: finished with status 'done'
  Running setup.py install for selenium: started
    Running setup.py install for selenium: finished with status 'done'
  Running setup.py install for funcsigs: started
    Running setup.py install for funcsigs: finished with status 'done'
  Running setup.py install for mock: started
    Running setup.py install for mock: finished with status 'done'
  Running setup.py install for chromedriver-installer: started
    Running setup.py install for chromedriver-installer: finished with status 'done'
Successfully installed chromedriver-installer-0.0.6 funcsigs-1.0.2 mock-2.0.0 pycodestyle-2.3.1 pyperclip-1.6.5 selenium-3.3.3 testscenarios-0.5.0
You are using pip version 9.0.3, however version 18.1 is available.
You should consider upgrading via the 'pip install --upgrade pip' command.
Running PEP-8 checks...

cd web && pycodestyle --config=.pycodestyle .
./pgadmin/utils/driver/psycopg2/connection.py:405: [E501] line too long (81 > 79 characters)
1
1       E501 line too long (81 > 79 characters)
make: *** [check-pep8] Error 1
ERROR: Error detected when running the Python PEP-8 checks.
ERROR: Error detected when running the Python tests.
Build step 'Execute shell' marked build as failure

Reply | Threaded
Open this post in threaded view
|

Build failed in Jenkins: pgadmin4-master-python26 #954

pgAdmin 4 Jenkins
See <https://jenkins.pgadmin.org/job/pgadmin4-master-python26/954/display/redirect?page=changes>

Changes:

[Dave Page] Fix PEP8 issue.

------------------------------------------
[...truncated 24.93 KB...]
  Cache entry deserialization failed, entry ignored
  Using cached https://files.pythonhosted.org/packages/f0/de/b0b5b98c0f38fd7086d082c47fcb455eedd39a044abe7c595f5f40cd6eed/testscenarios-0.5.0.tar.gz
Requirement already satisfied: testtools==2.3.0 in ./pgadmin-venv/lib/python2.6/site-packages (from -r web/regression/requirements.txt (line 12))
Requirement already satisfied: traceback2==1.4.0 in ./pgadmin-venv/lib/python2.6/site-packages (from -r web/regression/requirements.txt (line 13))
Requirement already satisfied: unittest2==1.1.0 in ./pgadmin-venv/lib/python2.6/site-packages (from -r web/regression/requirements.txt (line 14))
Collecting selenium==3.3.3 (from -r web/regression/requirements.txt (line 24))
  Cache entry deserialization failed, entry ignored
  Using cached https://files.pythonhosted.org/packages/0c/2d/6c51aceb5ad1f9fa75edc7dd47062af19ae79fe49b70ad0089060fb7ac69/selenium-3.3.3.tar.gz
Collecting mock===2.0.0 (from -r web/regression/requirements.txt (line 29))
  Cache entry deserialization failed, entry ignored
  Using cached https://files.pythonhosted.org/packages/0c/53/014354fc93c591ccc4abff12c473ad565a2eb24dcd82490fae33dbf2539f/mock-2.0.0.tar.gz
Collecting chromedriver_installer==0.0.6 (from -r web/regression/requirements.txt (line 33))
  Cache entry deserialization failed, entry ignored
  Using cached https://files.pythonhosted.org/packages/c8/01/0a8a725bb605f68923aba16099a01cbbfe547c8b7dc96fd9a554424f6524/chromedriver_installer-0.0.6.tar.gz
Requirement already satisfied: click>=2.0 in ./pgadmin-venv/lib/python2.6/site-packages (from Flask==0.12.4->-r web/regression/../../requirements.txt (line 9))
Requirement already satisfied: Jinja2>=2.4 in ./pgadmin-venv/lib/python2.6/site-packages (from Flask==0.12.4->-r web/regression/../../requirements.txt (line 9))
Requirement already satisfied: Werkzeug>=0.7 in ./pgadmin-venv/lib/python2.6/site-packages (from Flask==0.12.4->-r web/regression/../../requirements.txt (line 9))
Requirement already satisfied: itsdangerous>=0.21 in ./pgadmin-venv/lib/python2.6/site-packages (from Flask==0.12.4->-r web/regression/../../requirements.txt (line 9))
Requirement already satisfied: alembic>=0.6 in ./pgadmin-venv/lib/python2.6/site-packages (from Flask-Migrate==2.1.1->-r web/regression/../../requirements.txt (line 13))
Requirement already satisfied: webencodings in ./pgadmin-venv/lib/python2.6/site-packages (from html5lib==1.0.1->-r web/regression/../../requirements.txt (line 17))
Requirement already satisfied: Babel>=1.0 in ./pgadmin-venv/lib/python2.6/site-packages (from Flask-BabelEx==0.9.3->-r web/regression/../../requirements.txt (line 59))
Requirement already satisfied: argparse in ./pgadmin-venv/lib/python2.6/site-packages (from unittest2==1.1.0->-r web/regression/requirements.txt (line 14))
Collecting funcsigs>=1 (from mock===2.0.0->-r web/regression/requirements.txt (line 29))
  Cache entry deserialization failed, entry ignored
  Using cached https://files.pythonhosted.org/packages/94/4a/db842e7a0545de1cdb0439bb80e6e42dfe82aaeaadd4072f2263a4fbed23/funcsigs-1.0.2.tar.gz
Requirement already satisfied: MarkupSafe>=0.23 in ./pgadmin-venv/lib/python2.6/site-packages (from Jinja2>=2.4->Flask==0.12.4->-r web/regression/../../requirements.txt (line 9))
Requirement already satisfied: Mako in ./pgadmin-venv/lib/python2.6/site-packages (from alembic>=0.6->Flask-Migrate==2.1.1->-r web/regression/../../requirements.txt (line 13))
Requirement already satisfied: python-editor>=0.3 in ./pgadmin-venv/lib/python2.6/site-packages (from alembic>=0.6->Flask-Migrate==2.1.1->-r web/regression/../../requirements.txt (line 13))
Skipping bdist_wheel for pycodestyle, due to binaries being disabled for it.
Skipping bdist_wheel for pyperclip, due to binaries being disabled for it.
Skipping bdist_wheel for testscenarios, due to binaries being disabled for it.
Skipping bdist_wheel for selenium, due to binaries being disabled for it.
Skipping bdist_wheel for mock, due to binaries being disabled for it.
Skipping bdist_wheel for chromedriver-installer, due to binaries being disabled for it.
Skipping bdist_wheel for funcsigs, due to binaries being disabled for it.
Installing collected packages: pycodestyle, pyperclip, testscenarios, selenium, funcsigs, mock, chromedriver-installer
  Running setup.py install for pycodestyle: started
    Running setup.py install for pycodestyle: finished with status 'done'
  Running setup.py install for pyperclip: started
    Running setup.py install for pyperclip: finished with status 'done'
  Running setup.py install for testscenarios: started
    Running setup.py install for testscenarios: finished with status 'done'
  Running setup.py install for selenium: started
    Running setup.py install for selenium: finished with status 'done'
  Running setup.py install for funcsigs: started
    Running setup.py install for funcsigs: finished with status 'done'
  Running setup.py install for mock: started
    Running setup.py install for mock: finished with status 'done'
  Running setup.py install for chromedriver-installer: started
    Running setup.py install for chromedriver-installer: finished with status 'done'
Successfully installed chromedriver-installer-0.0.6 funcsigs-1.0.2 mock-2.0.0 pycodestyle-2.3.1 pyperclip-1.6.5 selenium-3.3.3 testscenarios-0.5.0
You are using pip version 9.0.3, however version 18.1 is available.
You should consider upgrading via the 'pip install --upgrade pip' command.
Running PEP-8 checks...

cd web && pycodestyle --config=.pycodestyle .
Running regression tests...

<https://jenkins.pgadmin.org/job/pgadmin4-master-python26/ws/pgadmin-venv/lib/python2.6/site-packages/flask_security/forms.py>:67: DeprecationWarning: Required is going away in WTForms 3.0, use DataRequired
  email_required = Required(message='EMAIL_NOT_PROVIDED')
<https://jenkins.pgadmin.org/job/pgadmin4-master-python26/ws/pgadmin-venv/lib/python2.6/site-packages/flask_security/forms.py>:69: DeprecationWarning: Required is going away in WTForms 3.0, use DataRequired
  password_required = Required(message='PASSWORD_NOT_PROVIDED')
2018-12-04 18:01:07,050: INFO pgadmin: ########################################################
2018-12-04 18:01:07,050: INFO pgadmin: Starting pgAdmin 4 v3.6...
2018-12-04 18:01:07,050: INFO pgadmin: ########################################################
2018-12-04 18:01:07,050: DEBUG pgadmin: Python syspath: ['<https://jenkins.pgadmin.org/job/pgadmin4-master-python26/ws/web/regression',> '<https://jenkins.pgadmin.org/job/pgadmin4-master-python26/ws/web',> '<https://jenkins.pgadmin.org/job/pgadmin4-master-python26/ws/web/regression',> '<https://jenkins.pgadmin.org/job/pgadmin4-master-python26/ws/pgadmin-venv/lib/python26.zip',> '<https://jenkins.pgadmin.org/job/pgadmin4-master-python26/ws/pgadmin-venv/lib/python2.6',> '<https://jenkins.pgadmin.org/job/pgadmin4-master-python26/ws/pgadmin-venv/lib/python2.6/plat-linux3',> '<https://jenkins.pgadmin.org/job/pgadmin4-master-python26/ws/pgadmin-venv/lib/python2.6/lib-tk',> '<https://jenkins.pgadmin.org/job/pgadmin4-master-python26/ws/pgadmin-venv/lib/python2.6/lib-old',> '<https://jenkins.pgadmin.org/job/pgadmin4-master-python26/ws/pgadmin-venv/lib/python2.6/lib-dynload',> '/usr/local/python-2.6/lib/python2.6', '/usr/local/python-2.6/lib/python2.6/plat-linux3', '/usr/local/python-2.6/lib/python2.6/lib-tk', '<https://jenkins.pgadmin.org/job/pgadmin4-master-python26/ws/pgadmin-venv/lib/python2.6/site-packages']>
2018-12-04 18:01:07,050: DEBUG pgadmin: Available translations: [Locale('pl'), Locale('zh'), Locale('de'), Locale('ja'), Locale('ru'), Locale('fr'), Locale('ko'), Locale('es')]
<https://jenkins.pgadmin.org/job/pgadmin4-master-python26/ws/pgadmin-venv/lib/python2.6/site-packages/flask_security/utils.py>:151: DeprecationWarning: the method passlib.context.CryptContext.encrypt() is deprecated as of Passlib 1.7, and will be removed in Passlib 2.0, use CryptContext.hash() instead.
  return _pwd_context.encrypt(signed)
2018-12-04 18:01:07,620: INFO pgadmin: Examining potential module: pgadmin.about
2018-12-04 18:01:07,621: INFO pgadmin: Registering blueprint module: <pgadmin.about.AboutModule object at 0x3e809d0>
2018-12-04 18:01:07,622: INFO pgadmin: Examining potential module: pgadmin.browser
2018-12-04 18:01:07,622: INFO pgadmin: Registering blueprint module: <pgadmin.browser.BrowserModule object at 0x360c250>
2018-12-04 18:01:07,622: INFO pgadmin: Examining potential module: pgadmin.browser.collection
2018-12-04 18:01:07,622: INFO pgadmin: Examining potential module: pgadmin.browser.register_browser_preferences
2018-12-04 18:01:07,622: INFO pgadmin: Examining potential module: pgadmin.browser.server_groups
2018-12-04 18:01:07,623: INFO pgadmin: Examining potential module: pgadmin.browser.tests
2018-12-04 18:01:07,623: INFO pgadmin: Examining potential module: pgadmin.browser.utils
2018-12-04 18:01:07,625: INFO pgadmin: Examining potential module: pgadmin.browser.server_groups.servers
2018-12-04 18:01:07,625: INFO pgadmin: Examining potential module: pgadmin.browser.server_groups.tests
2018-12-04 18:01:07,629: INFO pgadmin: Examining potential module: pgadmin.browser.server_groups.servers.databases
2018-12-04 18:01:07,629: INFO pgadmin: Examining potential module: pgadmin.browser.server_groups.servers.gpdb
2018-12-04 18:01:07,630: INFO pgadmin: Examining potential module: pgadmin.browser.server_groups.servers.pgagent
2018-12-04 18:01:07,633: INFO pgadmin: Examining potential module: pgadmin.browser.server_groups.servers.ppas
2018-12-04 18:01:07,633: INFO pgadmin: Examining potential module: pgadmin.browser.server_groups.servers.resource_groups
2018-12-04 18:01:07,637: INFO pgadmin: Examining potential module: pgadmin.browser.server_groups.servers.roles
2018-12-04 18:01:07,637: INFO pgadmin: Examining potential module: pgadmin.browser.server_groups.servers.tablespaces
2018-12-04 18:01:07,637: INFO pgadmin: Examining potential module: pgadmin.browser.server_groups.servers.tests
2018-12-04 18:01:07,638: INFO pgadmin: Examining potential module: pgadmin.browser.server_groups.servers.types
2018-12-04 18:01:07,638: INFO pgadmin: Examining potential module: pgadmin.browser.server_groups.servers.utils
2018-12-04 18:01:07,644: INFO pgadmin: Examining potential module: pgadmin.browser.server_groups.servers.databases.casts
2018-12-04 18:01:07,647: INFO pgadmin: Examining potential module: pgadmin.browser.server_groups.servers.databases.event_triggers
2018-12-04 18:01:07,651: INFO pgadmin: Examining potential module: pgadmin.browser.server_groups.servers.databases.extensions
2018-12-04 18:01:07,654: INFO pgadmin: Examining potential module: pgadmin.browser.server_groups.servers.databases.external_tables
2018-12-04 18:01:07,659: INFO pgadmin: Examining potential module: pgadmin.browser.server_groups.servers.databases.foreign_data_wrappers
2018-12-04 18:01:07,663: INFO pgadmin: Examining potential module: pgadmin.browser.server_groups.servers.databases.languages
2018-12-04 18:01:07,667: INFO pgadmin: Examining potential module: pgadmin.browser.server_groups.servers.databases.schemas
2018-12-04 18:01:07,667: INFO pgadmin: Examining potential module: pgadmin.browser.server_groups.servers.databases.tests
2018-12-04 18:01:07,667: INFO pgadmin: Examining potential module: pgadmin.browser.server_groups.servers.databases.utils
2018-12-04 18:01:07,675: INFO pgadmin: Examining potential module: pgadmin.browser.server_groups.servers.databases.casts.tests
2018-12-04 18:01:07,683: INFO pgadmin: Examining potential module: pgadmin.browser.server_groups.servers.databases.event_triggers.tests
2018-12-04 18:01:07,689: INFO pgadmin: Examining potential module: pgadmin.browser.server_groups.servers.databases.extensions.tests
2018-12-04 18:01:07,697: INFO pgadmin: Examining potential module: pgadmin.browser.server_groups.servers.databases.external_tables.actions
2018-12-04 18:01:07,697: INFO pgadmin: Examining potential module: pgadmin.browser.server_groups.servers.databases.external_tables.mapping_utils
2018-12-04 18:01:07,697: INFO pgadmin: Examining potential module: pgadmin.browser.server_groups.servers.databases.external_tables.properties
2018-12-04 18:01:07,697: INFO pgadmin: Examining potential module: pgadmin.browser.server_groups.servers.databases.external_tables.reverse_engineer_ddl
2018-12-04 18:01:07,698: INFO pgadmin: Examining potential module: pgadmin.browser.server_groups.servers.databases.external_tables.tests
2018-12-04 18:01:07,701: INFO pgadmin: Examining potential module: pgadmin.browser.server_groups.servers.databases.foreign_data_wrappers.foreign_servers
2018-12-04 18:01:07,706: INFO pgadmin: Examining potential module: pgadmin.browser.server_groups.servers.databases.foreign_data_wrappers.tests
2018-12-04 18:01:07,715: INFO pgadmin: Examining potential module: pgadmin.browser.server_groups.servers.databases.foreign_data_wrappers.foreign_servers.tests
2018-12-04 18:01:07,715: INFO pgadmin: Examining potential module: pgadmin.browser.server_groups.servers.databases.foreign_data_wrappers.foreign_servers.user_mapping
2018-12-04 18:01:07,726: INFO pgadmin: Examining potential module: pgadmin.browser.server_groups.servers.databases.foreign_data_wrappers.foreign_servers.user_mapping.tests
2018-12-04 18:01:07,734: INFO pgadmin: Examining potential module: pgadmin.browser.server_groups.servers.databases.languages.tests
2018-12-04 18:01:07,741: INFO pgadmin: Examining potential module: pgadmin.browser.server_groups.servers.databases.schemas.catalog_objects
2018-12-04 18:01:07,743: INFO pgadmin: Examining potential module: pgadmin.browser.server_groups.servers.databases.schemas.collations
2018-12-04 18:01:07,747: INFO pgadmin: Examining potential module: pgadmin.browser.server_groups.servers.databases.schemas.domains
2018-12-04 18:01:07,751: INFO pgadmin: Examining potential module: pgadmin.browser.server_groups.servers.databases.schemas.foreign_tables
2018-12-04 18:01:07,758: INFO pgadmin: Examining potential module: pgadmin.browser.server_groups.servers.databases.schemas.fts_configurations
2018-12-04 18:01:07,762: INFO pgadmin: Examining potential module: pgadmin.browser.server_groups.servers.databases.schemas.fts_dictionaries
2018-12-04 18:01:07,766: INFO pgadmin: Examining potential module: pgadmin.browser.server_groups.servers.databases.schemas.fts_parser
2018-12-04 18:01:07,770: INFO pgadmin: Examining potential module: pgadmin.browser.server_groups.servers.databases.schemas.fts_templates
2018-12-04 18:01:07,774: INFO pgadmin: Examining potential module: pgadmin.browser.server_groups.servers.databases.schemas.functions
2018-12-04 18:01:07,774: INFO pgadmin: Examining potential module: pgadmin.browser.server_groups.servers.databases.schemas.packages
2018-12-04 18:01:07,778: INFO pgadmin: Examining potential module: pgadmin.browser.server_groups.servers.databases.schemas.sequences
2018-12-04 18:01:07,783: INFO pgadmin: Examining potential module: pgadmin.browser.server_groups.servers.databases.schemas.synonyms
2018-12-04 18:01:07,786: INFO pgadmin: Examining potential module: pgadmin.browser.server_groups.servers.databases.schemas.tables
2018-12-04 18:01:07,807: INFO pgadmin: Examining potential module: pgadmin.browser.server_groups.servers.databases.schemas.tests
2018-12-04 18:01:07,807: INFO pgadmin: Examining potential module: pgadmin.browser.server_groups.servers.databases.schemas.types
2018-12-04 18:01:07,814: INFO pgadmin: Examining potential module: pgadmin.browser.server_groups.servers.databases.schemas.utils
2018-12-04 18:01:07,814: INFO pgadmin: Examining potential module: pgadmin.browser.server_groups.servers.databases.schemas.views
2018-12-04 18:01:07,828: INFO pgadmin: Examining potential module: pgadmin.browser.server_groups.servers.databases.schemas.catalog_objects.columns
2018-12-04 18:01:07,840: INFO pgadmin: Examining potential module: pgadmin.browser.server_groups.servers.databases.schemas.collations.tests
2018-12-04 18:01:07,848: INFO pgadmin: Examining potential module: pgadmin.browser.server_groups.servers.databases.schemas.domains.domain_constraints
2018-12-04 18:01:07,852: INFO pgadmin: Examining potential module: pgadmin.browser.server_groups.servers.databases.schemas.domains.tests
2018-12-04 18:01:07,868: INFO pgadmin: Examining potential module: pgadmin.browser.server_groups.servers.databases.schemas.foreign_tables.tests
2018-12-04 18:01:07,882: INFO pgadmin: Examining potential module: pgadmin.browser.server_groups.servers.databases.schemas.fts_configurations.tests
2018-12-04 18:01:07,894: INFO pgadmin: Examining potential module: pgadmin.browser.server_groups.servers.databases.schemas.fts_dictionaries.tests
2018-12-04 18:01:07,903: INFO pgadmin: Examining potential module: pgadmin.browser.server_groups.servers.databases.schemas.fts_parser.tests
2018-12-04 18:01:07,916: INFO pgadmin: Examining potential module: pgadmin.browser.server_groups.servers.databases.schemas.fts_templates.tests
2018-12-04 18:01:07,926: INFO pgadmin: Examining potential module: pgadmin.browser.server_groups.servers.databases.schemas.functions.tests
2018-12-04 18:01:07,938: INFO pgadmin: Examining potential module: pgadmin.browser.server_groups.servers.databases.schemas.functions.tests
2018-12-04 18:01:07,949: INFO pgadmin: Examining potential module: pgadmin.browser.server_groups.servers.databases.schemas.functions.tests
2018-12-04 18:01:07,960: INFO pgadmin: Examining potential module: pgadmin.browser.server_groups.servers.databases.schemas.packages.edbfuncs
2018-12-04 18:01:07,964: INFO pgadmin: Examining potential module: pgadmin.browser.server_groups.servers.databases.schemas.packages.edbvars
2018-12-04 18:01:07,966: INFO pgadmin: Examining potential module: pgadmin.browser.server_groups.servers.databases.schemas.packages.tests
2018-12-04 18:01:07,974: INFO pgadmin: Examining potential module: pgadmin.browser.server_groups.servers.databases.schemas.packages.edbfuncs.tests
2018-12-04 18:01:07,979: INFO pgadmin: Examining potential module: pgadmin.browser.server_groups.servers.databases.schemas.packages.edbfuncs.tests
2018-12-04 18:01:07,987: INFO pgadmin: Examining potential module: pgadmin.browser.server_groups.servers.databases.schemas.sequences.tests
2018-12-04 18:01:07,995: INFO pgadmin: Examining potential module: pgadmin.browser.server_groups.servers.databases.schemas.synonyms.tests
2018-12-04 18:01:08,003: INFO pgadmin: Examining potential module: pgadmin.browser.server_groups.servers.databases.schemas.tables.base_partition_table
2018-12-04 18:01:08,003: INFO pgadmin: Examining potential module: pgadmin.browser.server_groups.servers.databases.schemas.tables.column
2018-12-04 18:01:08,009: INFO pgadmin: Examining potential module: pgadmin.browser.server_groups.servers.databases.schemas.tables.constraints
2018-12-04 18:01:08,010: INFO pgadmin: Examining potential module: pgadmin.browser.server_groups.servers.databases.schemas.tables.indexes
2018-12-04 18:01:08,019: INFO pgadmin: Examining potential module: pgadmin.browser.server_groups.servers.databases.schemas.tables.partitions
2018-12-04 18:01:08,020: INFO pgadmin: Examining potential module: pgadmin.browser.server_groups.servers.databases.schemas.tables.rules
2018-12-04 18:01:08,023: INFO pgadmin: Examining potential module: pgadmin.browser.server_groups.servers.databases.schemas.tables.tests
2018-12-04 18:01:08,023: INFO pgadmin: Examining potential module: pgadmin.browser.server_groups.servers.databases.schemas.tables.triggers
2018-12-04 18:01:08,029: INFO pgadmin: Examining potential module: pgadmin.browser.server_groups.servers.databases.schemas.tables.utils
2018-12-04 18:01:08,049: INFO pgadmin: Examining potential module: pgadmin.browser.server_groups.servers.databases.schemas.tables.column.tests
2018-12-04 18:01:08,056: INFO pgadmin: Examining potential module: pgadmin.browser.server_groups.servers.databases.schemas.tables.constraints.check_constraint
2018-12-04 18:01:08,062: INFO pgadmin: Examining potential module: pgadmin.browser.server_groups.servers.databases.schemas.tables.constraints.exclusion_constraint
2018-12-04 18:01:08,068: INFO pgadmin: Examining potential module: pgadmin.browser.server_groups.servers.databases.schemas.tables.constraints.foreign_key
2018-12-04 18:01:08,074: INFO pgadmin: Examining potential module: pgadmin.browser.server_groups.servers.databases.schemas.tables.constraints.index_constraint
2018-12-04 18:01:08,082: INFO pgadmin: Examining potential module: pgadmin.browser.server_groups.servers.databases.schemas.tables.constraints.tests
2018-12-04 18:01:08,082: INFO pgadmin: Examining potential module: pgadmin.browser.server_groups.servers.databases.schemas.tables.constraints.type
2018-12-04 18:01:08,084: INFO pgadmin: Examining potential module: pgadmin.browser.server_groups.servers.databases.schemas.tables.constraints.check_constraint.tests
2018-12-04 18:01:08,127: INFO pgadmin: Examining potential module: pgadmin.browser.server_groups.servers.databases.schemas.tables.indexes.tests
2018-12-04 18:01:08,139: INFO pgadmin: Examining potential module: pgadmin.browser.server_groups.servers.databases.schemas.tables.partitions.tests
2018-12-04 18:01:08,140: INFO pgadmin: Examining potential module: pgadmin.browser.server_groups.servers.databases.schemas.tables.partitions.tests
2018-12-04 18:01:08,146: INFO pgadmin: Examining potential module: pgadmin.browser.server_groups.servers.databases.schemas.tables.rules.tests
2018-12-04 18:01:08,154: INFO pgadmin: Examining potential module: pgadmin.browser.server_groups.servers.databases.schemas.tables.triggers.tests
2018-12-04 18:01:08,164: INFO pgadmin: Examining potential module: pgadmin.browser.server_groups.servers.databases.schemas.types.tests
2018-12-04 18:01:08,179: INFO pgadmin: Examining potential module: pgadmin.browser.server_groups.servers.databases.schemas.views.children
2018-12-04 18:01:08,179: INFO pgadmin: Examining potential module: pgadmin.browser.server_groups.servers.databases.schemas.views.tests
2018-12-04 18:01:08,227: INFO pgadmin: Examining potential module: pgadmin.browser.server_groups.servers.databases.schemas.views.children
2018-12-04 18:01:08,227: INFO pgadmin: Examining potential module: pgadmin.browser.server_groups.servers.databases.schemas.views.tests
2018-12-04 18:01:08,276: INFO pgadmin: Examining potential module: pgadmin.browser.server_groups.servers.databases.schemas.catalog_objects
2018-12-04 18:01:08,277: INFO pgadmin: Examining potential module: pgadmin.browser.server_groups.servers.databases.schemas.collations
2018-12-04 18:01:08,277: INFO pgadmin: Examining potential module: pgadmin.browser.server_groups.servers.databases.schemas.domains
2018-12-04 18:01:08,277: INFO pgadmin: Examining potential module: pgadmin.browser.server_groups.servers.databases.schemas.foreign_tables
2018-12-04 18:01:08,277: INFO pgadmin: Examining potential module: pgadmin.browser.server_groups.servers.databases.schemas.fts_configurations
2018-12-04 18:01:08,277: INFO pgadmin: Examining potential module: pgadmin.browser.server_groups.servers.databases.schemas.fts_dictionaries
2018-12-04 18:01:08,277: INFO pgadmin: Examining potential module: pgadmin.browser.server_groups.servers.databases.schemas.fts_parser
2018-12-04 18:01:08,278: INFO pgadmin: Examining potential module: pgadmin.browser.server_groups.servers.databases.schemas.fts_templates
2018-12-04 18:01:08,278: INFO pgadmin: Examining potential module: pgadmin.browser.server_groups.servers.databases.schemas.functions
2018-12-04 18:01:08,278: INFO pgadmin: Examining potential module: pgadmin.browser.server_groups.servers.databases.schemas.packages
2018-12-04 18:01:08,278: INFO pgadmin: Examining potential module: pgadmin.browser.server_groups.servers.databases.schemas.sequences
2018-12-04 18:01:08,278: INFO pgadmin: Examining potential module: pgadmin.browser.server_groups.servers.databases.schemas.synonyms
2018-12-04 18:01:08,279: INFO pgadmin: Examining potential module: pgadmin.browser.server_groups.servers.databases.schemas.tables
2018-12-04 18:01:08,279: INFO pgadmin: Examining potential module: pgadmin.browser.server_groups.servers.databases.schemas.tests
2018-12-04 18:01:08,279: INFO pgadmin: Examining potential module: pgadmin.browser.server_groups.servers.databases.schemas.types
2018-12-04 18:01:08,279: INFO pgadmin: Examining potential module: pgadmin.browser.server_groups.servers.databases.schemas.utils
2018-12-04 18:01:08,279: INFO pgadmin: Examining potential module: pgadmin.browser.server_groups.servers.databases.schemas.views
2018-12-04 18:01:08,824: INFO pgadmin: Examining potential module: pgadmin.browser.server_groups.servers.pgagent.schedules
2018-12-04 18:01:08,828: INFO pgadmin: Examining potential module: pgadmin.browser.server_groups.servers.pgagent.steps
2018-12-04 18:01:08,831: INFO pgadmin: Examining potential module: pgadmin.browser.server_groups.servers.pgagent.tests
2018-12-04 18:01:08,843: INFO pgadmin: Examining potential module: pgadmin.browser.server_groups.servers.resource_groups.tests
2018-12-04 18:01:08,848: INFO pgadmin: Examining potential module: pgadmin.browser.server_groups.servers.roles.tests
2018-12-04 18:01:08,853: INFO pgadmin: Examining potential module: pgadmin.browser.server_groups.servers.tablespaces.tests
2018-12-04 18:01:08,859: INFO pgadmin: Examining potential module: pgadmin.dashboard
2018-12-04 18:01:08,862: INFO pgadmin: Registering blueprint module: <pgadmin.dashboard.DashboardModule object at 0x5209150>
2018-12-04 18:01:08,862: INFO pgadmin: Examining potential module: pgadmin.dashboard.tests
2018-12-04 18:01:08,871: INFO pgadmin: Examining potential module: pgadmin.feature_tests
2018-12-04 18:01:08,871: INFO pgadmin: Examining potential module: pgadmin.help
2018-12-04 18:01:08,872: INFO pgadmin: Registering blueprint module: <pgadmin.help.HelpModule object at 0x519d690>
2018-12-04 18:01:08,872: INFO pgadmin: Examining potential module: pgadmin.misc
2018-12-04 18:01:08,874: INFO pgadmin: Registering blueprint module: <pgadmin.misc.MiscModule object at 0x519dd10>
2018-12-04 18:01:08,874: INFO pgadmin: Examining potential module: pgadmin.misc.bgprocess
2018-12-04 18:01:08,898: INFO pgadmin: Examining potential module: pgadmin.misc.depends
2018-12-04 18:01:08,899: INFO pgadmin: Examining potential module: pgadmin.misc.file_manager
2018-12-04 18:01:08,907: INFO pgadmin: Examining potential module: pgadmin.misc.sql
2018-12-04 18:01:08,907: INFO pgadmin: Examining potential module: pgadmin.misc.statistics
2018-12-04 18:01:08,909: INFO pgadmin: Examining potential module: pgadmin.misc.bgprocess.process_executor
2018-12-04 18:01:08,912: INFO pgadmin: Examining potential module: pgadmin.misc.bgprocess.processes
2018-12-04 18:01:08,918: INFO pgadmin: Examining potential module: pgadmin.model
2018-12-04 18:01:08,918: INFO pgadmin: Examining potential module: pgadmin.preferences
2018-12-04 18:01:08,919: INFO pgadmin: Registering blueprint module: <pgadmin.preferences.PreferencesModule object at 0x52bfe90>
2018-12-04 18:01:08,921: INFO pgadmin: Examining potential module: pgadmin.redirects
2018-12-04 18:01:08,922: INFO pgadmin: Registering blueprint module: <pgadmin.utils.PgAdminModule object at 0x52ca650>
2018-12-04 18:01:08,922: INFO pgadmin: Examining potential module: pgadmin.settings
2018-12-04 18:01:08,923: INFO pgadmin: Registering blueprint module: <pgadmin.settings.SettingsModule object at 0x358cb50>
2018-12-04 18:01:08,924: INFO pgadmin: Examining potential module: pgadmin.setup
2018-12-04 18:01:08,925: INFO pgadmin: Examining potential module: pgadmin.tools
2018-12-04 18:01:08,925: INFO pgadmin: Registering blueprint module: <pgadmin.tools.ToolsModule object at 0x52caf90>
2018-12-04 18:01:08,926: INFO pgadmin: Examining potential module: pgadmin.tools.backup
2018-12-04 18:01:08,929: INFO pgadmin: Examining potential module: pgadmin.tools.datagrid
2018-12-04 18:01:08,989: INFO pgadmin: Examining potential module: pgadmin.tools.debugger
2018-12-04 18:01:08,998: INFO pgadmin: Examining potential module: pgadmin.tools.grant_wizard
2018-12-04 18:01:09,001: INFO pgadmin: Examining potential module: pgadmin.tools.import_export
2018-12-04 18:01:09,003: INFO pgadmin: Examining potential module: pgadmin.tools.maintenance
2018-12-04 18:01:09,005: INFO pgadmin: Examining potential module: pgadmin.tools.restore
2018-12-04 18:01:09,009: INFO pgadmin: Examining potential module: pgadmin.tools.sqleditor
2018-12-04 18:01:09,009: INFO pgadmin: Examining potential module: pgadmin.tools.user_management
2018-12-04 18:01:09,012: INFO pgadmin: Examining potential module: pgadmin.tools.backup.tests
2018-12-04 18:01:09,027: INFO pgadmin: Examining potential module: pgadmin.tools.import_export.tests
2018-12-04 18:01:09,029: INFO pgadmin: Examining potential module: pgadmin.tools.maintenance.tests
2018-12-04 18:01:09,030: INFO pgadmin: Examining potential module: pgadmin.tools.restore.tests
2018-12-04 18:01:09,032: INFO pgadmin: Examining potential module: pgadmin.tools.sqleditor.command
2018-12-04 18:01:09,032: INFO pgadmin: Examining potential module: pgadmin.tools.sqleditor.tests
2018-12-04 18:01:09,032: INFO pgadmin: Examining potential module: pgadmin.tools.sqleditor.utils
2018-12-04 18:01:09,040: INFO pgadmin: Examining potential module: pgadmin.utils
NOTE: Configuring authentication for DESKTOP mode.
pgAdmin 4 - Application Initialisation
======================================

Non-ASCII character '\xc5' in file <https://jenkins.pgadmin.org/job/pgadmin4-master-python26/ws/web/pgadmin/tools/sqleditor/tests/test_encoding_charset.py> on line 59, but no encoding declared; see http://www.python.org/peps/pep-0263.html for details (test_encoding_charset.py, line 59)
ERROR: Error detected when running the Python tests.
ERROR: Error detected when running the Python tests.
Build step 'Execute shell' marked build as failure

Reply | Threaded
Open this post in threaded view
|

Build failed in Jenkins: pgadmin4-master-python26 #955

pgAdmin 4 Jenkins
See <https://jenkins.pgadmin.org/job/pgadmin4-master-python26/955/display/redirect?page=changes>

Changes:

[Dave Page] Run Postfix in the container build so passwords can be reset etc. Fixes

------------------------------------------
[...truncated 24.87 KB...]
  Cache entry deserialization failed, entry ignored
  Using cached https://files.pythonhosted.org/packages/f0/de/b0b5b98c0f38fd7086d082c47fcb455eedd39a044abe7c595f5f40cd6eed/testscenarios-0.5.0.tar.gz
Requirement already satisfied: testtools==2.3.0 in ./pgadmin-venv/lib/python2.6/site-packages (from -r web/regression/requirements.txt (line 12))
Requirement already satisfied: traceback2==1.4.0 in ./pgadmin-venv/lib/python2.6/site-packages (from -r web/regression/requirements.txt (line 13))
Requirement already satisfied: unittest2==1.1.0 in ./pgadmin-venv/lib/python2.6/site-packages (from -r web/regression/requirements.txt (line 14))
Collecting selenium==3.3.3 (from -r web/regression/requirements.txt (line 24))
  Cache entry deserialization failed, entry ignored
  Using cached https://files.pythonhosted.org/packages/0c/2d/6c51aceb5ad1f9fa75edc7dd47062af19ae79fe49b70ad0089060fb7ac69/selenium-3.3.3.tar.gz
Collecting mock===2.0.0 (from -r web/regression/requirements.txt (line 29))
  Cache entry deserialization failed, entry ignored
  Using cached https://files.pythonhosted.org/packages/0c/53/014354fc93c591ccc4abff12c473ad565a2eb24dcd82490fae33dbf2539f/mock-2.0.0.tar.gz
Collecting chromedriver_installer==0.0.6 (from -r web/regression/requirements.txt (line 33))
  Cache entry deserialization failed, entry ignored
  Using cached https://files.pythonhosted.org/packages/c8/01/0a8a725bb605f68923aba16099a01cbbfe547c8b7dc96fd9a554424f6524/chromedriver_installer-0.0.6.tar.gz
Requirement already satisfied: click>=2.0 in ./pgadmin-venv/lib/python2.6/site-packages (from Flask==0.12.4->-r web/regression/../../requirements.txt (line 9))
Requirement already satisfied: Jinja2>=2.4 in ./pgadmin-venv/lib/python2.6/site-packages (from Flask==0.12.4->-r web/regression/../../requirements.txt (line 9))
Requirement already satisfied: Werkzeug>=0.7 in ./pgadmin-venv/lib/python2.6/site-packages (from Flask==0.12.4->-r web/regression/../../requirements.txt (line 9))
Requirement already satisfied: itsdangerous>=0.21 in ./pgadmin-venv/lib/python2.6/site-packages (from Flask==0.12.4->-r web/regression/../../requirements.txt (line 9))
Requirement already satisfied: alembic>=0.6 in ./pgadmin-venv/lib/python2.6/site-packages (from Flask-Migrate==2.1.1->-r web/regression/../../requirements.txt (line 13))
Requirement already satisfied: webencodings in ./pgadmin-venv/lib/python2.6/site-packages (from html5lib==1.0.1->-r web/regression/../../requirements.txt (line 17))
Requirement already satisfied: Babel>=1.0 in ./pgadmin-venv/lib/python2.6/site-packages (from Flask-BabelEx==0.9.3->-r web/regression/../../requirements.txt (line 59))
Requirement already satisfied: argparse in ./pgadmin-venv/lib/python2.6/site-packages (from unittest2==1.1.0->-r web/regression/requirements.txt (line 14))
Collecting funcsigs>=1 (from mock===2.0.0->-r web/regression/requirements.txt (line 29))
  Cache entry deserialization failed, entry ignored
  Using cached https://files.pythonhosted.org/packages/94/4a/db842e7a0545de1cdb0439bb80e6e42dfe82aaeaadd4072f2263a4fbed23/funcsigs-1.0.2.tar.gz
Requirement already satisfied: MarkupSafe>=0.23 in ./pgadmin-venv/lib/python2.6/site-packages (from Jinja2>=2.4->Flask==0.12.4->-r web/regression/../../requirements.txt (line 9))
Requirement already satisfied: Mako in ./pgadmin-venv/lib/python2.6/site-packages (from alembic>=0.6->Flask-Migrate==2.1.1->-r web/regression/../../requirements.txt (line 13))
Requirement already satisfied: python-editor>=0.3 in ./pgadmin-venv/lib/python2.6/site-packages (from alembic>=0.6->Flask-Migrate==2.1.1->-r web/regression/../../requirements.txt (line 13))
Skipping bdist_wheel for pycodestyle, due to binaries being disabled for it.
Skipping bdist_wheel for pyperclip, due to binaries being disabled for it.
Skipping bdist_wheel for testscenarios, due to binaries being disabled for it.
Skipping bdist_wheel for selenium, due to binaries being disabled for it.
Skipping bdist_wheel for mock, due to binaries being disabled for it.
Skipping bdist_wheel for chromedriver-installer, due to binaries being disabled for it.
Skipping bdist_wheel for funcsigs, due to binaries being disabled for it.
Installing collected packages: pycodestyle, pyperclip, testscenarios, selenium, funcsigs, mock, chromedriver-installer
  Running setup.py install for pycodestyle: started
    Running setup.py install for pycodestyle: finished with status 'done'
  Running setup.py install for pyperclip: started
    Running setup.py install for pyperclip: finished with status 'done'
  Running setup.py install for testscenarios: started
    Running setup.py install for testscenarios: finished with status 'done'
  Running setup.py install for selenium: started
    Running setup.py install for selenium: finished with status 'done'
  Running setup.py install for funcsigs: started
    Running setup.py install for funcsigs: finished with status 'done'
  Running setup.py install for mock: started
    Running setup.py install for mock: finished with status 'done'
  Running setup.py install for chromedriver-installer: started
    Running setup.py install for chromedriver-installer: finished with status 'done'
Successfully installed chromedriver-installer-0.0.6 funcsigs-1.0.2 mock-2.0.0 pycodestyle-2.3.1 pyperclip-1.6.5 selenium-3.3.3 testscenarios-0.5.0
You are using pip version 9.0.3, however version 18.1 is available.
You should consider upgrading via the 'pip install --upgrade pip' command.
Running PEP-8 checks...

cd web && pycodestyle --config=.pycodestyle .
Running regression tests...

<https://jenkins.pgadmin.org/job/pgadmin4-master-python26/ws/pgadmin-venv/lib/python2.6/site-packages/flask_security/forms.py>:67: DeprecationWarning: Required is going away in WTForms 3.0, use DataRequired
  email_required = Required(message='EMAIL_NOT_PROVIDED')
<https://jenkins.pgadmin.org/job/pgadmin4-master-python26/ws/pgadmin-venv/lib/python2.6/site-packages/flask_security/forms.py>:69: DeprecationWarning: Required is going away in WTForms 3.0, use DataRequired
  password_required = Required(message='PASSWORD_NOT_PROVIDED')
2018-12-05 15:11:45,622: INFO pgadmin: ########################################################
2018-12-05 15:11:45,622: INFO pgadmin: Starting pgAdmin 4 v3.6...
2018-12-05 15:11:45,622: INFO pgadmin: ########################################################
2018-12-05 15:11:45,622: DEBUG pgadmin: Python syspath: ['<https://jenkins.pgadmin.org/job/pgadmin4-master-python26/ws/web/regression',> '<https://jenkins.pgadmin.org/job/pgadmin4-master-python26/ws/web',> '<https://jenkins.pgadmin.org/job/pgadmin4-master-python26/ws/web/regression',> '<https://jenkins.pgadmin.org/job/pgadmin4-master-python26/ws/pgadmin-venv/lib/python26.zip',> '<https://jenkins.pgadmin.org/job/pgadmin4-master-python26/ws/pgadmin-venv/lib/python2.6',> '<https://jenkins.pgadmin.org/job/pgadmin4-master-python26/ws/pgadmin-venv/lib/python2.6/plat-linux3',> '<https://jenkins.pgadmin.org/job/pgadmin4-master-python26/ws/pgadmin-venv/lib/python2.6/lib-tk',> '<https://jenkins.pgadmin.org/job/pgadmin4-master-python26/ws/pgadmin-venv/lib/python2.6/lib-old',> '<https://jenkins.pgadmin.org/job/pgadmin4-master-python26/ws/pgadmin-venv/lib/python2.6/lib-dynload',> '/usr/local/python-2.6/lib/python2.6', '/usr/local/python-2.6/lib/python2.6/plat-linux3', '/usr/local/python-2.6/lib/python2.6/lib-tk', '<https://jenkins.pgadmin.org/job/pgadmin4-master-python26/ws/pgadmin-venv/lib/python2.6/site-packages']>
2018-12-05 15:11:45,623: DEBUG pgadmin: Available translations: [Locale('pl'), Locale('zh'), Locale('de'), Locale('ja'), Locale('ru'), Locale('fr'), Locale('ko'), Locale('es')]
<https://jenkins.pgadmin.org/job/pgadmin4-master-python26/ws/pgadmin-venv/lib/python2.6/site-packages/flask_security/utils.py>:151: DeprecationWarning: the method passlib.context.CryptContext.encrypt() is deprecated as of Passlib 1.7, and will be removed in Passlib 2.0, use CryptContext.hash() instead.
  return _pwd_context.encrypt(signed)
2018-12-05 15:11:46,440: INFO pgadmin: Examining potential module: pgadmin.about
2018-12-05 15:11:46,441: INFO pgadmin: Registering blueprint module: <pgadmin.about.AboutModule object at 0x47879d0>
2018-12-05 15:11:46,442: INFO pgadmin: Examining potential module: pgadmin.browser
2018-12-05 15:11:46,442: INFO pgadmin: Registering blueprint module: <pgadmin.browser.BrowserModule object at 0x3d95250>
2018-12-05 15:11:46,443: INFO pgadmin: Examining potential module: pgadmin.browser.collection
2018-12-05 15:11:46,443: INFO pgadmin: Examining potential module: pgadmin.browser.register_browser_preferences
2018-12-05 15:11:46,443: INFO pgadmin: Examining potential module: pgadmin.browser.server_groups
2018-12-05 15:11:46,443: INFO pgadmin: Examining potential module: pgadmin.browser.tests
2018-12-05 15:11:46,444: INFO pgadmin: Examining potential module: pgadmin.browser.utils
2018-12-05 15:11:46,446: INFO pgadmin: Examining potential module: pgadmin.browser.server_groups.servers
2018-12-05 15:11:46,446: INFO pgadmin: Examining potential module: pgadmin.browser.server_groups.tests
2018-12-05 15:11:46,450: INFO pgadmin: Examining potential module: pgadmin.browser.server_groups.servers.databases
2018-12-05 15:11:46,450: INFO pgadmin: Examining potential module: pgadmin.browser.server_groups.servers.gpdb
2018-12-05 15:11:46,450: INFO pgadmin: Examining potential module: pgadmin.browser.server_groups.servers.pgagent
2018-12-05 15:11:46,453: INFO pgadmin: Examining potential module: pgadmin.browser.server_groups.servers.ppas
2018-12-05 15:11:46,454: INFO pgadmin: Examining potential module: pgadmin.browser.server_groups.servers.resource_groups
2018-12-05 15:11:46,457: INFO pgadmin: Examining potential module: pgadmin.browser.server_groups.servers.roles
2018-12-05 15:11:46,458: INFO pgadmin: Examining potential module: pgadmin.browser.server_groups.servers.tablespaces
2018-12-05 15:11:46,458: INFO pgadmin: Examining potential module: pgadmin.browser.server_groups.servers.tests
2018-12-05 15:11:46,458: INFO pgadmin: Examining potential module: pgadmin.browser.server_groups.servers.types
2018-12-05 15:11:46,459: INFO pgadmin: Examining potential module: pgadmin.browser.server_groups.servers.utils
2018-12-05 15:11:46,465: INFO pgadmin: Examining potential module: pgadmin.browser.server_groups.servers.databases.casts
2018-12-05 15:11:46,468: INFO pgadmin: Examining potential module: pgadmin.browser.server_groups.servers.databases.event_triggers
2018-12-05 15:11:46,472: INFO pgadmin: Examining potential module: pgadmin.browser.server_groups.servers.databases.extensions
2018-12-05 15:11:46,475: INFO pgadmin: Examining potential module: pgadmin.browser.server_groups.servers.databases.external_tables
2018-12-05 15:11:46,479: INFO pgadmin: Examining potential module: pgadmin.browser.server_groups.servers.databases.foreign_data_wrappers
2018-12-05 15:11:46,483: INFO pgadmin: Examining potential module: pgadmin.browser.server_groups.servers.databases.languages
2018-12-05 15:11:46,487: INFO pgadmin: Examining potential module: pgadmin.browser.server_groups.servers.databases.schemas
2018-12-05 15:11:46,488: INFO pgadmin: Examining potential module: pgadmin.browser.server_groups.servers.databases.tests
2018-12-05 15:11:46,488: INFO pgadmin: Examining potential module: pgadmin.browser.server_groups.servers.databases.utils
2018-12-05 15:11:46,496: INFO pgadmin: Examining potential module: pgadmin.browser.server_groups.servers.databases.casts.tests
2018-12-05 15:11:46,503: INFO pgadmin: Examining potential module: pgadmin.browser.server_groups.servers.databases.event_triggers.tests
2018-12-05 15:11:46,510: INFO pgadmin: Examining potential module: pgadmin.browser.server_groups.servers.databases.extensions.tests
2018-12-05 15:11:46,518: INFO pgadmin: Examining potential module: pgadmin.browser.server_groups.servers.databases.external_tables.actions
2018-12-05 15:11:46,518: INFO pgadmin: Examining potential module: pgadmin.browser.server_groups.servers.databases.external_tables.mapping_utils
2018-12-05 15:11:46,518: INFO pgadmin: Examining potential module: pgadmin.browser.server_groups.servers.databases.external_tables.properties
2018-12-05 15:11:46,518: INFO pgadmin: Examining potential module: pgadmin.browser.server_groups.servers.databases.external_tables.reverse_engineer_ddl
2018-12-05 15:11:46,518: INFO pgadmin: Examining potential module: pgadmin.browser.server_groups.servers.databases.external_tables.tests
2018-12-05 15:11:46,522: INFO pgadmin: Examining potential module: pgadmin.browser.server_groups.servers.databases.foreign_data_wrappers.foreign_servers
2018-12-05 15:11:46,527: INFO pgadmin: Examining potential module: pgadmin.browser.server_groups.servers.databases.foreign_data_wrappers.tests
2018-12-05 15:11:46,535: INFO pgadmin: Examining potential module: pgadmin.browser.server_groups.servers.databases.foreign_data_wrappers.foreign_servers.tests
2018-12-05 15:11:46,535: INFO pgadmin: Examining potential module: pgadmin.browser.server_groups.servers.databases.foreign_data_wrappers.foreign_servers.user_mapping
2018-12-05 15:11:46,546: INFO pgadmin: Examining potential module: pgadmin.browser.server_groups.servers.databases.foreign_data_wrappers.foreign_servers.user_mapping.tests
2018-12-05 15:11:46,554: INFO pgadmin: Examining potential module: pgadmin.browser.server_groups.servers.databases.languages.tests
2018-12-05 15:11:46,561: INFO pgadmin: Examining potential module: pgadmin.browser.server_groups.servers.databases.schemas.catalog_objects
2018-12-05 15:11:46,563: INFO pgadmin: Examining potential module: pgadmin.browser.server_groups.servers.databases.schemas.collations
2018-12-05 15:11:46,567: INFO pgadmin: Examining potential module: pgadmin.browser.server_groups.servers.databases.schemas.domains
2018-12-05 15:11:46,571: INFO pgadmin: Examining potential module: pgadmin.browser.server_groups.servers.databases.schemas.foreign_tables
2018-12-05 15:11:46,578: INFO pgadmin: Examining potential module: pgadmin.browser.server_groups.servers.databases.schemas.fts_configurations
2018-12-05 15:11:46,582: INFO pgadmin: Examining potential module: pgadmin.browser.server_groups.servers.databases.schemas.fts_dictionaries
2018-12-05 15:11:46,586: INFO pgadmin: Examining potential module: pgadmin.browser.server_groups.servers.databases.schemas.fts_parser
2018-12-05 15:11:46,590: INFO pgadmin: Examining potential module: pgadmin.browser.server_groups.servers.databases.schemas.fts_templates
2018-12-05 15:11:46,594: INFO pgadmin: Examining potential module: pgadmin.browser.server_groups.servers.databases.schemas.functions
2018-12-05 15:11:46,594: INFO pgadmin: Examining potential module: pgadmin.browser.server_groups.servers.databases.schemas.packages
2018-12-05 15:11:46,598: INFO pgadmin: Examining potential module: pgadmin.browser.server_groups.servers.databases.schemas.sequences
2018-12-05 15:11:46,603: INFO pgadmin: Examining potential module: pgadmin.browser.server_groups.servers.databases.schemas.synonyms
2018-12-05 15:11:46,606: INFO pgadmin: Examining potential module: pgadmin.browser.server_groups.servers.databases.schemas.tables
2018-12-05 15:11:46,626: INFO pgadmin: Examining potential module: pgadmin.browser.server_groups.servers.databases.schemas.tests
2018-12-05 15:11:46,627: INFO pgadmin: Examining potential module: pgadmin.browser.server_groups.servers.databases.schemas.types
2018-12-05 15:11:46,634: INFO pgadmin: Examining potential module: pgadmin.browser.server_groups.servers.databases.schemas.utils
2018-12-05 15:11:46,634: INFO pgadmin: Examining potential module: pgadmin.browser.server_groups.servers.databases.schemas.views
2018-12-05 15:11:46,648: INFO pgadmin: Examining potential module: pgadmin.browser.server_groups.servers.databases.schemas.catalog_objects.columns
2018-12-05 15:11:46,660: INFO pgadmin: Examining potential module: pgadmin.browser.server_groups.servers.databases.schemas.collations.tests
2018-12-05 15:11:46,668: INFO pgadmin: Examining potential module: pgadmin.browser.server_groups.servers.databases.schemas.domains.domain_constraints
2018-12-05 15:11:46,672: INFO pgadmin: Examining potential module: pgadmin.browser.server_groups.servers.databases.schemas.domains.tests
2018-12-05 15:11:46,688: INFO pgadmin: Examining potential module: pgadmin.browser.server_groups.servers.databases.schemas.foreign_tables.tests
2018-12-05 15:11:46,702: INFO pgadmin: Examining potential module: pgadmin.browser.server_groups.servers.databases.schemas.fts_configurations.tests
2018-12-05 15:11:46,714: INFO pgadmin: Examining potential module: pgadmin.browser.server_groups.servers.databases.schemas.fts_dictionaries.tests
2018-12-05 15:11:46,723: INFO pgadmin: Examining potential module: pgadmin.browser.server_groups.servers.databases.schemas.fts_parser.tests
2018-12-05 15:11:46,736: INFO pgadmin: Examining potential module: pgadmin.browser.server_groups.servers.databases.schemas.fts_templates.tests
2018-12-05 15:11:46,745: INFO pgadmin: Examining potential module: pgadmin.browser.server_groups.servers.databases.schemas.functions.tests
2018-12-05 15:11:46,756: INFO pgadmin: Examining potential module: pgadmin.browser.server_groups.servers.databases.schemas.functions.tests
2018-12-05 15:11:46,767: INFO pgadmin: Examining potential module: pgadmin.browser.server_groups.servers.databases.schemas.functions.tests
2018-12-05 15:11:46,779: INFO pgadmin: Examining potential module: pgadmin.browser.server_groups.servers.databases.schemas.packages.edbfuncs
2018-12-05 15:11:46,782: INFO pgadmin: Examining potential module: pgadmin.browser.server_groups.servers.databases.schemas.packages.edbvars
2018-12-05 15:11:46,784: INFO pgadmin: Examining potential module: pgadmin.browser.server_groups.servers.databases.schemas.packages.tests
2018-12-05 15:11:46,792: INFO pgadmin: Examining potential module: pgadmin.browser.server_groups.servers.databases.schemas.packages.edbfuncs.tests
2018-12-05 15:11:46,797: INFO pgadmin: Examining potential module: pgadmin.browser.server_groups.servers.databases.schemas.packages.edbfuncs.tests
2018-12-05 15:11:46,805: INFO pgadmin: Examining potential module: pgadmin.browser.server_groups.servers.databases.schemas.sequences.tests
2018-12-05 15:11:46,813: INFO pgadmin: Examining potential module: pgadmin.browser.server_groups.servers.databases.schemas.synonyms.tests
2018-12-05 15:11:46,821: INFO pgadmin: Examining potential module: pgadmin.browser.server_groups.servers.databases.schemas.tables.base_partition_table
2018-12-05 15:11:46,822: INFO pgadmin: Examining potential module: pgadmin.browser.server_groups.servers.databases.schemas.tables.column
2018-12-05 15:11:46,827: INFO pgadmin: Examining potential module: pgadmin.browser.server_groups.servers.databases.schemas.tables.constraints
2018-12-05 15:11:46,828: INFO pgadmin: Examining potential module: pgadmin.browser.server_groups.servers.databases.schemas.tables.indexes
2018-12-05 15:11:46,837: INFO pgadmin: Examining potential module: pgadmin.browser.server_groups.servers.databases.schemas.tables.partitions
2018-12-05 15:11:46,838: INFO pgadmin: Examining potential module: pgadmin.browser.server_groups.servers.databases.schemas.tables.rules
2018-12-05 15:11:46,841: INFO pgadmin: Examining potential module: pgadmin.browser.server_groups.servers.databases.schemas.tables.tests
2018-12-05 15:11:46,841: INFO pgadmin: Examining potential module: pgadmin.browser.server_groups.servers.databases.schemas.tables.triggers
2018-12-05 15:11:46,847: INFO pgadmin: Examining potential module: pgadmin.browser.server_groups.servers.databases.schemas.tables.utils
2018-12-05 15:11:46,867: INFO pgadmin: Examining potential module: pgadmin.browser.server_groups.servers.databases.schemas.tables.column.tests
2018-12-05 15:11:46,874: INFO pgadmin: Examining potential module: pgadmin.browser.server_groups.servers.databases.schemas.tables.constraints.check_constraint
2018-12-05 15:11:46,879: INFO pgadmin: Examining potential module: pgadmin.browser.server_groups.servers.databases.schemas.tables.constraints.exclusion_constraint
2018-12-05 15:11:46,885: INFO pgadmin: Examining potential module: pgadmin.browser.server_groups.servers.databases.schemas.tables.constraints.foreign_key
2018-12-05 15:11:46,892: INFO pgadmin: Examining potential module: pgadmin.browser.server_groups.servers.databases.schemas.tables.constraints.index_constraint
2018-12-05 15:11:46,899: INFO pgadmin: Examining potential module: pgadmin.browser.server_groups.servers.databases.schemas.tables.constraints.tests
2018-12-05 15:11:46,900: INFO pgadmin: Examining potential module: pgadmin.browser.server_groups.servers.databases.schemas.tables.constraints.type
2018-12-05 15:11:46,902: INFO pgadmin: Examining potential module: pgadmin.browser.server_groups.servers.databases.schemas.tables.constraints.check_constraint.tests
2018-12-05 15:11:46,944: INFO pgadmin: Examining potential module: pgadmin.browser.server_groups.servers.databases.schemas.tables.indexes.tests
2018-12-05 15:11:46,956: INFO pgadmin: Examining potential module: pgadmin.browser.server_groups.servers.databases.schemas.tables.partitions.tests
2018-12-05 15:11:46,957: INFO pgadmin: Examining potential module: pgadmin.browser.server_groups.servers.databases.schemas.tables.partitions.tests
2018-12-05 15:11:46,963: INFO pgadmin: Examining potential module: pgadmin.browser.server_groups.servers.databases.schemas.tables.rules.tests
2018-12-05 15:11:46,972: INFO pgadmin: Examining potential module: pgadmin.browser.server_groups.servers.databases.schemas.tables.triggers.tests
2018-12-05 15:11:46,982: INFO pgadmin: Examining potential module: pgadmin.browser.server_groups.servers.databases.schemas.types.tests
2018-12-05 15:11:46,996: INFO pgadmin: Examining potential module: pgadmin.browser.server_groups.servers.databases.schemas.views.children
2018-12-05 15:11:46,996: INFO pgadmin: Examining potential module: pgadmin.browser.server_groups.servers.databases.schemas.views.tests
2018-12-05 15:11:47,044: INFO pgadmin: Examining potential module: pgadmin.browser.server_groups.servers.databases.schemas.views.children
2018-12-05 15:11:47,045: INFO pgadmin: Examining potential module: pgadmin.browser.server_groups.servers.databases.schemas.views.tests
2018-12-05 15:11:47,093: INFO pgadmin: Examining potential module: pgadmin.browser.server_groups.servers.databases.schemas.catalog_objects
2018-12-05 15:11:47,093: INFO pgadmin: Examining potential module: pgadmin.browser.server_groups.servers.databases.schemas.collations
2018-12-05 15:11:47,094: INFO pgadmin: Examining potential module: pgadmin.browser.server_groups.servers.databases.schemas.domains
2018-12-05 15:11:47,094: INFO pgadmin: Examining potential module: pgadmin.browser.server_groups.servers.databases.schemas.foreign_tables
2018-12-05 15:11:47,094: INFO pgadmin: Examining potential module: pgadmin.browser.server_groups.servers.databases.schemas.fts_configurations
2018-12-05 15:11:47,094: INFO pgadmin: Examining potential module: pgadmin.browser.server_groups.servers.databases.schemas.fts_dictionaries
2018-12-05 15:11:47,094: INFO pgadmin: Examining potential module: pgadmin.browser.server_groups.servers.databases.schemas.fts_parser
2018-12-05 15:11:47,094: INFO pgadmin: Examining potential module: pgadmin.browser.server_groups.servers.databases.schemas.fts_templates
2018-12-05 15:11:47,095: INFO pgadmin: Examining potential module: pgadmin.browser.server_groups.servers.databases.schemas.functions
2018-12-05 15:11:47,095: INFO pgadmin: Examining potential module: pgadmin.browser.server_groups.servers.databases.schemas.packages
2018-12-05 15:11:47,095: INFO pgadmin: Examining potential module: pgadmin.browser.server_groups.servers.databases.schemas.sequences
2018-12-05 15:11:47,095: INFO pgadmin: Examining potential module: pgadmin.browser.server_groups.servers.databases.schemas.synonyms
2018-12-05 15:11:47,095: INFO pgadmin: Examining potential module: pgadmin.browser.server_groups.servers.databases.schemas.tables
2018-12-05 15:11:47,096: INFO pgadmin: Examining potential module: pgadmin.browser.server_groups.servers.databases.schemas.tests
2018-12-05 15:11:47,096: INFO pgadmin: Examining potential module: pgadmin.browser.server_groups.servers.databases.schemas.types
2018-12-05 15:11:47,096: INFO pgadmin: Examining potential module: pgadmin.browser.server_groups.servers.databases.schemas.utils
2018-12-05 15:11:47,096: INFO pgadmin: Examining potential module: pgadmin.browser.server_groups.servers.databases.schemas.views
2018-12-05 15:11:47,639: INFO pgadmin: Examining potential module: pgadmin.browser.server_groups.servers.pgagent.schedules
2018-12-05 15:11:47,643: INFO pgadmin: Examining potential module: pgadmin.browser.server_groups.servers.pgagent.steps
2018-12-05 15:11:47,646: INFO pgadmin: Examining potential module: pgadmin.browser.server_groups.servers.pgagent.tests
2018-12-05 15:11:47,658: INFO pgadmin: Examining potential module: pgadmin.browser.server_groups.servers.resource_groups.tests
2018-12-05 15:11:47,663: INFO pgadmin: Examining potential module: pgadmin.browser.server_groups.servers.roles.tests
2018-12-05 15:11:47,668: INFO pgadmin: Examining potential module: pgadmin.browser.server_groups.servers.tablespaces.tests
2018-12-05 15:11:47,674: INFO pgadmin: Examining potential module: pgadmin.dashboard
2018-12-05 15:11:47,677: INFO pgadmin: Registering blueprint module: <pgadmin.dashboard.DashboardModule object at 0x5991150>
2018-12-05 15:11:47,677: INFO pgadmin: Examining potential module: pgadmin.dashboard.tests
2018-12-05 15:11:47,686: INFO pgadmin: Examining potential module: pgadmin.feature_tests
2018-12-05 15:11:47,686: INFO pgadmin: Examining potential module: pgadmin.help
2018-12-05 15:11:47,687: INFO pgadmin: Registering blueprint module: <pgadmin.help.HelpModule object at 0x5925690>
2018-12-05 15:11:47,688: INFO pgadmin: Examining potential module: pgadmin.misc
2018-12-05 15:11:47,689: INFO pgadmin: Registering blueprint module: <pgadmin.misc.MiscModule object at 0x5925d10>
2018-12-05 15:11:47,689: INFO pgadmin: Examining potential module: pgadmin.misc.bgprocess
2018-12-05 15:11:47,713: INFO pgadmin: Examining potential module: pgadmin.misc.depends
2018-12-05 15:11:47,714: INFO pgadmin: Examining potential module: pgadmin.misc.file_manager
2018-12-05 15:11:47,721: INFO pgadmin: Examining potential module: pgadmin.misc.sql
2018-12-05 15:11:47,722: INFO pgadmin: Examining potential module: pgadmin.misc.statistics
2018-12-05 15:11:47,724: INFO pgadmin: Examining potential module: pgadmin.misc.bgprocess.process_executor
2018-12-05 15:11:47,726: INFO pgadmin: Examining potential module: pgadmin.misc.bgprocess.processes
2018-12-05 15:11:47,732: INFO pgadmin: Examining potential module: pgadmin.model
2018-12-05 15:11:47,732: INFO pgadmin: Examining potential module: pgadmin.preferences
2018-12-05 15:11:47,734: INFO pgadmin: Registering blueprint module: <pgadmin.preferences.PreferencesModule object at 0x5a47e90>
2018-12-05 15:11:47,735: INFO pgadmin: Examining potential module: pgadmin.redirects
2018-12-05 15:11:47,736: INFO pgadmin: Registering blueprint module: <pgadmin.utils.PgAdminModule object at 0x5a52650>
2018-12-05 15:11:47,737: INFO pgadmin: Examining potential module: pgadmin.settings
2018-12-05 15:11:47,737: INFO pgadmin: Registering blueprint module: <pgadmin.settings.SettingsModule object at 0x3d14b50>
2018-12-05 15:11:47,739: INFO pgadmin: Examining potential module: pgadmin.setup
2018-12-05 15:11:47,739: INFO pgadmin: Examining potential module: pgadmin.tools
2018-12-05 15:11:47,740: INFO pgadmin: Registering blueprint module: <pgadmin.tools.ToolsModule object at 0x5a52f90>
2018-12-05 15:11:47,740: INFO pgadmin: Examining potential module: pgadmin.tools.backup
2018-12-05 15:11:47,744: INFO pgadmin: Examining potential module: pgadmin.tools.datagrid
2018-12-05 15:11:47,803: INFO pgadmin: Examining potential module: pgadmin.tools.debugger
2018-12-05 15:11:47,813: INFO pgadmin: Examining potential module: pgadmin.tools.grant_wizard
2018-12-05 15:11:47,815: INFO pgadmin: Examining potential module: pgadmin.tools.import_export
2018-12-05 15:11:47,818: INFO pgadmin: Examining potential module: pgadmin.tools.maintenance
2018-12-05 15:11:47,820: INFO pgadmin: Examining potential module: pgadmin.tools.restore
2018-12-05 15:11:47,823: INFO pgadmin: Examining potential module: pgadmin.tools.sqleditor
2018-12-05 15:11:47,823: INFO pgadmin: Examining potential module: pgadmin.tools.user_management
2018-12-05 15:11:47,826: INFO pgadmin: Examining potential module: pgadmin.tools.backup.tests
2018-12-05 15:11:47,841: INFO pgadmin: Examining potential module: pgadmin.tools.import_export.tests
2018-12-05 15:11:47,843: INFO pgadmin: Examining potential module: pgadmin.tools.maintenance.tests
2018-12-05 15:11:47,844: INFO pgadmin: Examining potential module: pgadmin.tools.restore.tests
2018-12-05 15:11:47,846: INFO pgadmin: Examining potential module: pgadmin.tools.sqleditor.command
2018-12-05 15:11:47,846: INFO pgadmin: Examining potential module: pgadmin.tools.sqleditor.tests
2018-12-05 15:11:47,847: INFO pgadmin: Examining potential module: pgadmin.tools.sqleditor.utils
2018-12-05 15:11:47,854: INFO pgadmin: Examining potential module: pgadmin.utils
NOTE: Configuring authentication for DESKTOP mode.
pgAdmin 4 - Application Initialisation
======================================

Non-ASCII character '\xc5' in file <https://jenkins.pgadmin.org/job/pgadmin4-master-python26/ws/web/pgadmin/tools/sqleditor/tests/test_encoding_charset.py> on line 59, but no encoding declared; see http://www.python.org/peps/pep-0263.html for details (test_encoding_charset.py, line 59)
ERROR: Error detected when running the Python tests.
ERROR: Error detected when running the Python tests.
Build step 'Execute shell' marked build as failure

Reply | Threaded
Open this post in threaded view
|

Build failed in Jenkins: pgadmin4-master-python26 #956

pgAdmin 4 Jenkins
See <https://jenkins.pgadmin.org/job/pgadmin4-master-python26/956/display/redirect?page=changes>

Changes:

[Dave Page] Allow servers to be pre-loaded into container deployments. Fixes #3801

------------------------------------------
[...truncated 24.47 KB...]
  Using cached https://files.pythonhosted.org/packages/80/a4/7c65c8fb16787d74f720dfb1dee4227a65058f268e91014e24fd76b18f8b/pyperclip-1.6.5.tar.gz
Collecting testscenarios==0.5.0 (from -r web/regression/requirements.txt (line 11))
  Cache entry deserialization failed, entry ignored
  Using cached https://files.pythonhosted.org/packages/f0/de/b0b5b98c0f38fd7086d082c47fcb455eedd39a044abe7c595f5f40cd6eed/testscenarios-0.5.0.tar.gz
Requirement already satisfied: testtools==2.3.0 in ./pgadmin-venv/lib/python2.6/site-packages (from -r web/regression/requirements.txt (line 12))
Requirement already satisfied: traceback2==1.4.0 in ./pgadmin-venv/lib/python2.6/site-packages (from -r web/regression/requirements.txt (line 13))
Requirement already satisfied: unittest2==1.1.0 in ./pgadmin-venv/lib/python2.6/site-packages (from -r web/regression/requirements.txt (line 14))
Collecting selenium==3.3.3 (from -r web/regression/requirements.txt (line 24))
  Cache entry deserialization failed, entry ignored
  Using cached https://files.pythonhosted.org/packages/0c/2d/6c51aceb5ad1f9fa75edc7dd47062af19ae79fe49b70ad0089060fb7ac69/selenium-3.3.3.tar.gz
Collecting mock===2.0.0 (from -r web/regression/requirements.txt (line 29))
  Using cached https://files.pythonhosted.org/packages/0c/53/014354fc93c591ccc4abff12c473ad565a2eb24dcd82490fae33dbf2539f/mock-2.0.0.tar.gz
Collecting chromedriver_installer==0.0.6 (from -r web/regression/requirements.txt (line 33))
  Cache entry deserialization failed, entry ignored
  Using cached https://files.pythonhosted.org/packages/c8/01/0a8a725bb605f68923aba16099a01cbbfe547c8b7dc96fd9a554424f6524/chromedriver_installer-0.0.6.tar.gz
Requirement already satisfied: click>=2.0 in ./pgadmin-venv/lib/python2.6/site-packages (from Flask==0.12.4->-r web/regression/../../requirements.txt (line 9))
Requirement already satisfied: Jinja2>=2.4 in ./pgadmin-venv/lib/python2.6/site-packages (from Flask==0.12.4->-r web/regression/../../requirements.txt (line 9))
Requirement already satisfied: Werkzeug>=0.7 in ./pgadmin-venv/lib/python2.6/site-packages (from Flask==0.12.4->-r web/regression/../../requirements.txt (line 9))
Requirement already satisfied: itsdangerous>=0.21 in ./pgadmin-venv/lib/python2.6/site-packages (from Flask==0.12.4->-r web/regression/../../requirements.txt (line 9))
Requirement already satisfied: alembic>=0.6 in ./pgadmin-venv/lib/python2.6/site-packages (from Flask-Migrate==2.1.1->-r web/regression/../../requirements.txt (line 13))
Requirement already satisfied: webencodings in ./pgadmin-venv/lib/python2.6/site-packages (from html5lib==1.0.1->-r web/regression/../../requirements.txt (line 17))
Requirement already satisfied: Babel>=1.0 in ./pgadmin-venv/lib/python2.6/site-packages (from Flask-BabelEx==0.9.3->-r web/regression/../../requirements.txt (line 59))
Requirement already satisfied: argparse in ./pgadmin-venv/lib/python2.6/site-packages (from unittest2==1.1.0->-r web/regression/requirements.txt (line 14))
Collecting funcsigs>=1 (from mock===2.0.0->-r web/regression/requirements.txt (line 29))
  Using cached https://files.pythonhosted.org/packages/94/4a/db842e7a0545de1cdb0439bb80e6e42dfe82aaeaadd4072f2263a4fbed23/funcsigs-1.0.2.tar.gz
Requirement already satisfied: MarkupSafe>=0.23 in ./pgadmin-venv/lib/python2.6/site-packages (from Jinja2>=2.4->Flask==0.12.4->-r web/regression/../../requirements.txt (line 9))
Requirement already satisfied: Mako in ./pgadmin-venv/lib/python2.6/site-packages (from alembic>=0.6->Flask-Migrate==2.1.1->-r web/regression/../../requirements.txt (line 13))
Requirement already satisfied: python-editor>=0.3 in ./pgadmin-venv/lib/python2.6/site-packages (from alembic>=0.6->Flask-Migrate==2.1.1->-r web/regression/../../requirements.txt (line 13))
Skipping bdist_wheel for pycodestyle, due to binaries being disabled for it.
Skipping bdist_wheel for pyperclip, due to binaries being disabled for it.
Skipping bdist_wheel for testscenarios, due to binaries being disabled for it.
Skipping bdist_wheel for selenium, due to binaries being disabled for it.
Skipping bdist_wheel for mock, due to binaries being disabled for it.
Skipping bdist_wheel for chromedriver-installer, due to binaries being disabled for it.
Skipping bdist_wheel for funcsigs, due to binaries being disabled for it.
Installing collected packages: pycodestyle, pyperclip, testscenarios, selenium, funcsigs, mock, chromedriver-installer
  Running setup.py install for pycodestyle: started
    Running setup.py install for pycodestyle: finished with status 'done'
  Running setup.py install for pyperclip: started
    Running setup.py install for pyperclip: finished with status 'done'
  Running setup.py install for testscenarios: started
    Running setup.py install for testscenarios: finished with status 'done'
  Running setup.py install for selenium: started
    Running setup.py install for selenium: finished with status 'done'
  Running setup.py install for funcsigs: started
    Running setup.py install for funcsigs: finished with status 'done'
  Running setup.py install for mock: started
    Running setup.py install for mock: finished with status 'done'
  Running setup.py install for chromedriver-installer: started
    Running setup.py install for chromedriver-installer: finished with status 'done'
Successfully installed chromedriver-installer-0.0.6 funcsigs-1.0.2 mock-2.0.0 pycodestyle-2.3.1 pyperclip-1.6.5 selenium-3.3.3 testscenarios-0.5.0
You are using pip version 9.0.3, however version 18.1 is available.
You should consider upgrading via the 'pip install --upgrade pip' command.
Running PEP-8 checks...

cd web && pycodestyle --config=.pycodestyle .
Running regression tests...

<https://jenkins.pgadmin.org/job/pgadmin4-master-python26/ws/pgadmin-venv/lib/python2.6/site-packages/flask_security/forms.py>:67: DeprecationWarning: Required is going away in WTForms 3.0, use DataRequired
  email_required = Required(message='EMAIL_NOT_PROVIDED')
<https://jenkins.pgadmin.org/job/pgadmin4-master-python26/ws/pgadmin-venv/lib/python2.6/site-packages/flask_security/forms.py>:69: DeprecationWarning: Required is going away in WTForms 3.0, use DataRequired
  password_required = Required(message='PASSWORD_NOT_PROVIDED')
2018-12-05 17:17:38,688: INFO pgadmin: ########################################################
2018-12-05 17:17:38,688: INFO pgadmin: Starting pgAdmin 4 v3.6...
2018-12-05 17:17:38,688: INFO pgadmin: ########################################################
2018-12-05 17:17:38,688: DEBUG pgadmin: Python syspath: ['<https://jenkins.pgadmin.org/job/pgadmin4-master-python26/ws/web/regression',> '<https://jenkins.pgadmin.org/job/pgadmin4-master-python26/ws/web',> '<https://jenkins.pgadmin.org/job/pgadmin4-master-python26/ws/web/regression',> '<https://jenkins.pgadmin.org/job/pgadmin4-master-python26/ws/pgadmin-venv/lib/python26.zip',> '<https://jenkins.pgadmin.org/job/pgadmin4-master-python26/ws/pgadmin-venv/lib/python2.6',> '<https://jenkins.pgadmin.org/job/pgadmin4-master-python26/ws/pgadmin-venv/lib/python2.6/plat-linux3',> '<https://jenkins.pgadmin.org/job/pgadmin4-master-python26/ws/pgadmin-venv/lib/python2.6/lib-tk',> '<https://jenkins.pgadmin.org/job/pgadmin4-master-python26/ws/pgadmin-venv/lib/python2.6/lib-old',> '<https://jenkins.pgadmin.org/job/pgadmin4-master-python26/ws/pgadmin-venv/lib/python2.6/lib-dynload',> '/usr/local/python-2.6/lib/python2.6', '/usr/local/python-2.6/lib/python2.6/plat-linux3', '/usr/local/python-2.6/lib/python2.6/lib-tk', '<https://jenkins.pgadmin.org/job/pgadmin4-master-python26/ws/pgadmin-venv/lib/python2.6/site-packages']>
2018-12-05 17:17:38,689: DEBUG pgadmin: Available translations: [Locale('pl'), Locale('zh'), Locale('de'), Locale('ja'), Locale('ru'), Locale('fr'), Locale('ko'), Locale('es')]
<https://jenkins.pgadmin.org/job/pgadmin4-master-python26/ws/pgadmin-venv/lib/python2.6/site-packages/flask_security/utils.py>:151: DeprecationWarning: the method passlib.context.CryptContext.encrypt() is deprecated as of Passlib 1.7, and will be removed in Passlib 2.0, use CryptContext.hash() instead.
  return _pwd_context.encrypt(signed)
2018-12-05 17:17:39,267: INFO pgadmin: Examining potential module: pgadmin.about
2018-12-05 17:17:39,268: INFO pgadmin: Registering blueprint module: <pgadmin.about.AboutModule object at 0x4af9b10>
2018-12-05 17:17:39,269: INFO pgadmin: Examining potential module: pgadmin.browser
2018-12-05 17:17:39,269: INFO pgadmin: Registering blueprint module: <pgadmin.browser.BrowserModule object at 0x4106250>
2018-12-05 17:17:39,269: INFO pgadmin: Examining potential module: pgadmin.browser.collection
2018-12-05 17:17:39,270: INFO pgadmin: Examining potential module: pgadmin.browser.register_browser_preferences
2018-12-05 17:17:39,270: INFO pgadmin: Examining potential module: pgadmin.browser.server_groups
2018-12-05 17:17:39,270: INFO pgadmin: Examining potential module: pgadmin.browser.tests
2018-12-05 17:17:39,270: INFO pgadmin: Examining potential module: pgadmin.browser.utils
2018-12-05 17:17:39,272: INFO pgadmin: Examining potential module: pgadmin.browser.server_groups.servers
2018-12-05 17:17:39,273: INFO pgadmin: Examining potential module: pgadmin.browser.server_groups.tests
2018-12-05 17:17:39,276: INFO pgadmin: Examining potential module: pgadmin.browser.server_groups.servers.databases
2018-12-05 17:17:39,276: INFO pgadmin: Examining potential module: pgadmin.browser.server_groups.servers.gpdb
2018-12-05 17:17:39,277: INFO pgadmin: Examining potential module: pgadmin.browser.server_groups.servers.pgagent
2018-12-05 17:17:39,280: INFO pgadmin: Examining potential module: pgadmin.browser.server_groups.servers.ppas
2018-12-05 17:17:39,281: INFO pgadmin: Examining potential module: pgadmin.browser.server_groups.servers.resource_groups
2018-12-05 17:17:39,284: INFO pgadmin: Examining potential module: pgadmin.browser.server_groups.servers.roles
2018-12-05 17:17:39,285: INFO pgadmin: Examining potential module: pgadmin.browser.server_groups.servers.tablespaces
2018-12-05 17:17:39,285: INFO pgadmin: Examining potential module: pgadmin.browser.server_groups.servers.tests
2018-12-05 17:17:39,285: INFO pgadmin: Examining potential module: pgadmin.browser.server_groups.servers.types
2018-12-05 17:17:39,285: INFO pgadmin: Examining potential module: pgadmin.browser.server_groups.servers.utils
2018-12-05 17:17:39,291: INFO pgadmin: Examining potential module: pgadmin.browser.server_groups.servers.databases.casts
2018-12-05 17:17:39,295: INFO pgadmin: Examining potential module: pgadmin.browser.server_groups.servers.databases.event_triggers
2018-12-05 17:17:39,299: INFO pgadmin: Examining potential module: pgadmin.browser.server_groups.servers.databases.extensions
2018-12-05 17:17:39,302: INFO pgadmin: Examining potential module: pgadmin.browser.server_groups.servers.databases.external_tables
2018-12-05 17:17:39,306: INFO pgadmin: Examining potential module: pgadmin.browser.server_groups.servers.databases.foreign_data_wrappers
2018-12-05 17:17:39,310: INFO pgadmin: Examining potential module: pgadmin.browser.server_groups.servers.databases.languages
2018-12-05 17:17:39,314: INFO pgadmin: Examining potential module: pgadmin.browser.server_groups.servers.databases.schemas
2018-12-05 17:17:39,314: INFO pgadmin: Examining potential module: pgadmin.browser.server_groups.servers.databases.tests
2018-12-05 17:17:39,314: INFO pgadmin: Examining potential module: pgadmin.browser.server_groups.servers.databases.utils
2018-12-05 17:17:39,322: INFO pgadmin: Examining potential module: pgadmin.browser.server_groups.servers.databases.casts.tests
2018-12-05 17:17:39,330: INFO pgadmin: Examining potential module: pgadmin.browser.server_groups.servers.databases.event_triggers.tests
2018-12-05 17:17:39,337: INFO pgadmin: Examining potential module: pgadmin.browser.server_groups.servers.databases.extensions.tests
2018-12-05 17:17:39,344: INFO pgadmin: Examining potential module: pgadmin.browser.server_groups.servers.databases.external_tables.actions
2018-12-05 17:17:39,344: INFO pgadmin: Examining potential module: pgadmin.browser.server_groups.servers.databases.external_tables.mapping_utils
2018-12-05 17:17:39,345: INFO pgadmin: Examining potential module: pgadmin.browser.server_groups.servers.databases.external_tables.properties
2018-12-05 17:17:39,345: INFO pgadmin: Examining potential module: pgadmin.browser.server_groups.servers.databases.external_tables.reverse_engineer_ddl
2018-12-05 17:17:39,345: INFO pgadmin: Examining potential module: pgadmin.browser.server_groups.servers.databases.external_tables.tests
2018-12-05 17:17:39,348: INFO pgadmin: Examining potential module: pgadmin.browser.server_groups.servers.databases.foreign_data_wrappers.foreign_servers
2018-12-05 17:17:39,353: INFO pgadmin: Examining potential module: pgadmin.browser.server_groups.servers.databases.foreign_data_wrappers.tests
2018-12-05 17:17:39,361: INFO pgadmin: Examining potential module: pgadmin.browser.server_groups.servers.databases.foreign_data_wrappers.foreign_servers.tests
2018-12-05 17:17:39,362: INFO pgadmin: Examining potential module: pgadmin.browser.server_groups.servers.databases.foreign_data_wrappers.foreign_servers.user_mapping
2018-12-05 17:17:39,373: INFO pgadmin: Examining potential module: pgadmin.browser.server_groups.servers.databases.foreign_data_wrappers.foreign_servers.user_mapping.tests
2018-12-05 17:17:39,381: INFO pgadmin: Examining potential module: pgadmin.browser.server_groups.servers.databases.languages.tests
2018-12-05 17:17:39,388: INFO pgadmin: Examining potential module: pgadmin.browser.server_groups.servers.databases.schemas.catalog_objects
2018-12-05 17:17:39,390: INFO pgadmin: Examining potential module: pgadmin.browser.server_groups.servers.databases.schemas.collations
2018-12-05 17:17:39,393: INFO pgadmin: Examining potential module: pgadmin.browser.server_groups.servers.databases.schemas.domains
2018-12-05 17:17:39,398: INFO pgadmin: Examining potential module: pgadmin.browser.server_groups.servers.databases.schemas.foreign_tables
2018-12-05 17:17:39,404: INFO pgadmin: Examining potential module: pgadmin.browser.server_groups.servers.databases.schemas.fts_configurations
2018-12-05 17:17:39,409: INFO pgadmin: Examining potential module: pgadmin.browser.server_groups.servers.databases.schemas.fts_dictionaries
2018-12-05 17:17:39,413: INFO pgadmin: Examining potential module: pgadmin.browser.server_groups.servers.databases.schemas.fts_parser
2018-12-05 17:17:39,416: INFO pgadmin: Examining potential module: pgadmin.browser.server_groups.servers.databases.schemas.fts_templates
2018-12-05 17:17:39,420: INFO pgadmin: Examining potential module: pgadmin.browser.server_groups.servers.databases.schemas.functions
2018-12-05 17:17:39,420: INFO pgadmin: Examining potential module: pgadmin.browser.server_groups.servers.databases.schemas.packages
2018-12-05 17:17:39,425: INFO pgadmin: Examining potential module: pgadmin.browser.server_groups.servers.databases.schemas.sequences
2018-12-05 17:17:39,429: INFO pgadmin: Examining potential module: pgadmin.browser.server_groups.servers.databases.schemas.synonyms
2018-12-05 17:17:39,432: INFO pgadmin: Examining potential module: pgadmin.browser.server_groups.servers.databases.schemas.tables
2018-12-05 17:17:39,453: INFO pgadmin: Examining potential module: pgadmin.browser.server_groups.servers.databases.schemas.tests
2018-12-05 17:17:39,453: INFO pgadmin: Examining potential module: pgadmin.browser.server_groups.servers.databases.schemas.types
2018-12-05 17:17:39,460: INFO pgadmin: Examining potential module: pgadmin.browser.server_groups.servers.databases.schemas.utils
2018-12-05 17:17:39,460: INFO pgadmin: Examining potential module: pgadmin.browser.server_groups.servers.databases.schemas.views
2018-12-05 17:17:39,474: INFO pgadmin: Examining potential module: pgadmin.browser.server_groups.servers.databases.schemas.catalog_objects.columns
2018-12-05 17:17:39,486: INFO pgadmin: Examining potential module: pgadmin.browser.server_groups.servers.databases.schemas.collations.tests
2018-12-05 17:17:39,494: INFO pgadmin: Examining potential module: pgadmin.browser.server_groups.servers.databases.schemas.domains.domain_constraints
2018-12-05 17:17:39,498: INFO pgadmin: Examining potential module: pgadmin.browser.server_groups.servers.databases.schemas.domains.tests
2018-12-05 17:17:39,515: INFO pgadmin: Examining potential module: pgadmin.browser.server_groups.servers.databases.schemas.foreign_tables.tests
2018-12-05 17:17:39,529: INFO pgadmin: Examining potential module: pgadmin.browser.server_groups.servers.databases.schemas.fts_configurations.tests
2018-12-05 17:17:39,541: INFO pgadmin: Examining potential module: pgadmin.browser.server_groups.servers.databases.schemas.fts_dictionaries.tests
2018-12-05 17:17:39,550: INFO pgadmin: Examining potential module: pgadmin.browser.server_groups.servers.databases.schemas.fts_parser.tests
2018-12-05 17:17:39,562: INFO pgadmin: Examining potential module: pgadmin.browser.server_groups.servers.databases.schemas.fts_templates.tests
2018-12-05 17:17:39,572: INFO pgadmin: Examining potential module: pgadmin.browser.server_groups.servers.databases.schemas.functions.tests
2018-12-05 17:17:39,583: INFO pgadmin: Examining potential module: pgadmin.browser.server_groups.servers.databases.schemas.functions.tests
2018-12-05 17:17:39,594: INFO pgadmin: Examining potential module: pgadmin.browser.server_groups.servers.databases.schemas.functions.tests
2018-12-05 17:17:39,605: INFO pgadmin: Examining potential module: pgadmin.browser.server_groups.servers.databases.schemas.packages.edbfuncs
2018-12-05 17:17:39,609: INFO pgadmin: Examining potential module: pgadmin.browser.server_groups.servers.databases.schemas.packages.edbvars
2018-12-05 17:17:39,611: INFO pgadmin: Examining potential module: pgadmin.browser.server_groups.servers.databases.schemas.packages.tests
2018-12-05 17:17:39,619: INFO pgadmin: Examining potential module: pgadmin.browser.server_groups.servers.databases.schemas.packages.edbfuncs.tests
2018-12-05 17:17:39,624: INFO pgadmin: Examining potential module: pgadmin.browser.server_groups.servers.databases.schemas.packages.edbfuncs.tests
2018-12-05 17:17:39,632: INFO pgadmin: Examining potential module: pgadmin.browser.server_groups.servers.databases.schemas.sequences.tests
2018-12-05 17:17:39,639: INFO pgadmin: Examining potential module: pgadmin.browser.server_groups.servers.databases.schemas.synonyms.tests
2018-12-05 17:17:39,648: INFO pgadmin: Examining potential module: pgadmin.browser.server_groups.servers.databases.schemas.tables.base_partition_table
2018-12-05 17:17:39,648: INFO pgadmin: Examining potential module: pgadmin.browser.server_groups.servers.databases.schemas.tables.column
2018-12-05 17:17:39,653: INFO pgadmin: Examining potential module: pgadmin.browser.server_groups.servers.databases.schemas.tables.constraints
2018-12-05 17:17:39,655: INFO pgadmin: Examining potential module: pgadmin.browser.server_groups.servers.databases.schemas.tables.indexes
2018-12-05 17:17:39,664: INFO pgadmin: Examining potential module: pgadmin.browser.server_groups.servers.databases.schemas.tables.partitions
2018-12-05 17:17:39,664: INFO pgadmin: Examining potential module: pgadmin.browser.server_groups.servers.databases.schemas.tables.rules
2018-12-05 17:17:39,667: INFO pgadmin: Examining potential module: pgadmin.browser.server_groups.servers.databases.schemas.tables.tests
2018-12-05 17:17:39,668: INFO pgadmin: Examining potential module: pgadmin.browser.server_groups.servers.databases.schemas.tables.triggers
2018-12-05 17:17:39,673: INFO pgadmin: Examining potential module: pgadmin.browser.server_groups.servers.databases.schemas.tables.utils
2018-12-05 17:17:39,693: INFO pgadmin: Examining potential module: pgadmin.browser.server_groups.servers.databases.schemas.tables.column.tests
2018-12-05 17:17:39,700: INFO pgadmin: Examining potential module: pgadmin.browser.server_groups.servers.databases.schemas.tables.constraints.check_constraint
2018-12-05 17:17:39,705: INFO pgadmin: Examining potential module: pgadmin.browser.server_groups.servers.databases.schemas.tables.constraints.exclusion_constraint
2018-12-05 17:17:39,711: INFO pgadmin: Examining potential module: pgadmin.browser.server_groups.servers.databases.schemas.tables.constraints.foreign_key
2018-12-05 17:17:39,718: INFO pgadmin: Examining potential module: pgadmin.browser.server_groups.servers.databases.schemas.tables.constraints.index_constraint
2018-12-05 17:17:39,725: INFO pgadmin: Examining potential module: pgadmin.browser.server_groups.servers.databases.schemas.tables.constraints.tests
2018-12-05 17:17:39,725: INFO pgadmin: Examining potential module: pgadmin.browser.server_groups.servers.databases.schemas.tables.constraints.type
2018-12-05 17:17:39,727: INFO pgadmin: Examining potential module: pgadmin.browser.server_groups.servers.databases.schemas.tables.constraints.check_constraint.tests
2018-12-05 17:17:39,769: INFO pgadmin: Examining potential module: pgadmin.browser.server_groups.servers.databases.schemas.tables.indexes.tests
2018-12-05 17:17:39,782: INFO pgadmin: Examining potential module: pgadmin.browser.server_groups.servers.databases.schemas.tables.partitions.tests
2018-12-05 17:17:39,782: INFO pgadmin: Examining potential module: pgadmin.browser.server_groups.servers.databases.schemas.tables.partitions.tests
2018-12-05 17:17:39,788: INFO pgadmin: Examining potential module: pgadmin.browser.server_groups.servers.databases.schemas.tables.rules.tests
2018-12-05 17:17:39,797: INFO pgadmin: Examining potential module: pgadmin.browser.server_groups.servers.databases.schemas.tables.triggers.tests
2018-12-05 17:17:39,807: INFO pgadmin: Examining potential module: pgadmin.browser.server_groups.servers.databases.schemas.types.tests
2018-12-05 17:17:39,821: INFO pgadmin: Examining potential module: pgadmin.browser.server_groups.servers.databases.schemas.views.children
2018-12-05 17:17:39,821: INFO pgadmin: Examining potential module: pgadmin.browser.server_groups.servers.databases.schemas.views.tests
2018-12-05 17:17:39,869: INFO pgadmin: Examining potential module: pgadmin.browser.server_groups.servers.databases.schemas.views.children
2018-12-05 17:17:39,869: INFO pgadmin: Examining potential module: pgadmin.browser.server_groups.servers.databases.schemas.views.tests
2018-12-05 17:17:39,918: INFO pgadmin: Examining potential module: pgadmin.browser.server_groups.servers.databases.schemas.catalog_objects
2018-12-05 17:17:39,918: INFO pgadmin: Examining potential module: pgadmin.browser.server_groups.servers.databases.schemas.collations
2018-12-05 17:17:39,918: INFO pgadmin: Examining potential module: pgadmin.browser.server_groups.servers.databases.schemas.domains
2018-12-05 17:17:39,918: INFO pgadmin: Examining potential module: pgadmin.browser.server_groups.servers.databases.schemas.foreign_tables
2018-12-05 17:17:39,918: INFO pgadmin: Examining potential module: pgadmin.browser.server_groups.servers.databases.schemas.fts_configurations
2018-12-05 17:17:39,919: INFO pgadmin: Examining potential module: pgadmin.browser.server_groups.servers.databases.schemas.fts_dictionaries
2018-12-05 17:17:39,919: INFO pgadmin: Examining potential module: pgadmin.browser.server_groups.servers.databases.schemas.fts_parser
2018-12-05 17:17:39,919: INFO pgadmin: Examining potential module: pgadmin.browser.server_groups.servers.databases.schemas.fts_templates
2018-12-05 17:17:39,919: INFO pgadmin: Examining potential module: pgadmin.browser.server_groups.servers.databases.schemas.functions
2018-12-05 17:17:39,919: INFO pgadmin: Examining potential module: pgadmin.browser.server_groups.servers.databases.schemas.packages
2018-12-05 17:17:39,919: INFO pgadmin: Examining potential module: pgadmin.browser.server_groups.servers.databases.schemas.sequences
2018-12-05 17:17:39,920: INFO pgadmin: Examining potential module: pgadmin.browser.server_groups.servers.databases.schemas.synonyms
2018-12-05 17:17:39,920: INFO pgadmin: Examining potential module: pgadmin.browser.server_groups.servers.databases.schemas.tables
2018-12-05 17:17:39,920: INFO pgadmin: Examining potential module: pgadmin.browser.server_groups.servers.databases.schemas.tests
2018-12-05 17:17:39,920: INFO pgadmin: Examining potential module: pgadmin.browser.server_groups.servers.databases.schemas.types
2018-12-05 17:17:39,920: INFO pgadmin: Examining potential module: pgadmin.browser.server_groups.servers.databases.schemas.utils
2018-12-05 17:17:39,921: INFO pgadmin: Examining potential module: pgadmin.browser.server_groups.servers.databases.schemas.views
2018-12-05 17:17:40,462: INFO pgadmin: Examining potential module: pgadmin.browser.server_groups.servers.pgagent.schedules
2018-12-05 17:17:40,465: INFO pgadmin: Examining potential module: pgadmin.browser.server_groups.servers.pgagent.steps
2018-12-05 17:17:40,468: INFO pgadmin: Examining potential module: pgadmin.browser.server_groups.servers.pgagent.tests
2018-12-05 17:17:40,481: INFO pgadmin: Examining potential module: pgadmin.browser.server_groups.servers.resource_groups.tests
2018-12-05 17:17:40,486: INFO pgadmin: Examining potential module: pgadmin.browser.server_groups.servers.roles.tests
2018-12-05 17:17:40,491: INFO pgadmin: Examining potential module: pgadmin.browser.server_groups.servers.tablespaces.tests
2018-12-05 17:17:40,497: INFO pgadmin: Examining potential module: pgadmin.dashboard
2018-12-05 17:17:40,500: INFO pgadmin: Registering blueprint module: <pgadmin.dashboard.DashboardModule object at 0x5d02150>
2018-12-05 17:17:40,500: INFO pgadmin: Examining potential module: pgadmin.dashboard.tests
2018-12-05 17:17:40,509: INFO pgadmin: Examining potential module: pgadmin.feature_tests
2018-12-05 17:17:40,509: INFO pgadmin: Examining potential module: pgadmin.help
2018-12-05 17:17:40,510: INFO pgadmin: Registering blueprint module: <pgadmin.help.HelpModule object at 0x5c96690>
2018-12-05 17:17:40,510: INFO pgadmin: Examining potential module: pgadmin.misc
2018-12-05 17:17:40,511: INFO pgadmin: Registering blueprint module: <pgadmin.misc.MiscModule object at 0x5c96d10>
2018-12-05 17:17:40,512: INFO pgadmin: Examining potential module: pgadmin.misc.bgprocess
2018-12-05 17:17:40,536: INFO pgadmin: Examining potential module: pgadmin.misc.depends
2018-12-05 17:17:40,537: INFO pgadmin: Examining potential module: pgadmin.misc.file_manager
2018-12-05 17:17:40,544: INFO pgadmin: Examining potential module: pgadmin.misc.sql
2018-12-05 17:17:40,545: INFO pgadmin: Examining potential module: pgadmin.misc.statistics
2018-12-05 17:17:40,546: INFO pgadmin: Examining potential module: pgadmin.misc.bgprocess.process_executor
2018-12-05 17:17:40,549: INFO pgadmin: Examining potential module: pgadmin.misc.bgprocess.processes
2018-12-05 17:17:40,555: INFO pgadmin: Examining potential module: pgadmin.model
2018-12-05 17:17:40,555: INFO pgadmin: Examining potential module: pgadmin.preferences
2018-12-05 17:17:40,557: INFO pgadmin: Registering blueprint module: <pgadmin.preferences.PreferencesModule object at 0x5db8e90>
2018-12-05 17:17:40,558: INFO pgadmin: Examining potential module: pgadmin.redirects
2018-12-05 17:17:40,559: INFO pgadmin: Registering blueprint module: <pgadmin.utils.PgAdminModule object at 0x5dc3650>
2018-12-05 17:17:40,559: INFO pgadmin: Examining potential module: pgadmin.settings
2018-12-05 17:17:40,560: INFO pgadmin: Registering blueprint module: <pgadmin.settings.SettingsModule object at 0x4085b50>
2018-12-05 17:17:40,562: INFO pgadmin: Examining potential module: pgadmin.setup
2018-12-05 17:17:40,562: INFO pgadmin: Examining potential module: pgadmin.tools
2018-12-05 17:17:40,563: INFO pgadmin: Registering blueprint module: <pgadmin.tools.ToolsModule object at 0x5dc3f90>
2018-12-05 17:17:40,563: INFO pgadmin: Examining potential module: pgadmin.tools.backup
2018-12-05 17:17:40,566: INFO pgadmin: Examining potential module: pgadmin.tools.datagrid
2018-12-05 17:17:40,626: INFO pgadmin: Examining potential module: pgadmin.tools.debugger
2018-12-05 17:17:40,635: INFO pgadmin: Examining potential module: pgadmin.tools.grant_wizard
2018-12-05 17:17:40,638: INFO pgadmin: Examining potential module: pgadmin.tools.import_export
2018-12-05 17:17:40,640: INFO pgadmin: Examining potential module: pgadmin.tools.maintenance
2018-12-05 17:17:40,642: INFO pgadmin: Examining potential module: pgadmin.tools.restore
2018-12-05 17:17:40,645: INFO pgadmin: Examining potential module: pgadmin.tools.sqleditor
2018-12-05 17:17:40,646: INFO pgadmin: Examining potential module: pgadmin.tools.user_management
2018-12-05 17:17:40,649: INFO pgadmin: Examining potential module: pgadmin.tools.backup.tests
2018-12-05 17:17:40,664: INFO pgadmin: Examining potential module: pgadmin.tools.import_export.tests
2018-12-05 17:17:40,665: INFO pgadmin: Examining potential module: pgadmin.tools.maintenance.tests
2018-12-05 17:17:40,667: INFO pgadmin: Examining potential module: pgadmin.tools.restore.tests
2018-12-05 17:17:40,668: INFO pgadmin: Examining potential module: pgadmin.tools.sqleditor.command
2018-12-05 17:17:40,669: INFO pgadmin: Examining potential module: pgadmin.tools.sqleditor.tests
2018-12-05 17:17:40,669: INFO pgadmin: Examining potential module: pgadmin.tools.sqleditor.utils
2018-12-05 17:17:40,677: INFO pgadmin: Examining potential module: pgadmin.utils
NOTE: Configuring authentication for DESKTOP mode.
pgAdmin 4 - Application Initialisation
======================================

Non-ASCII character '\xc5' in file <https://jenkins.pgadmin.org/job/pgadmin4-master-python26/ws/web/pgadmin/tools/sqleditor/tests/test_encoding_charset.py> on line 59, but no encoding declared; see http://www.python.org/peps/pep-0263.html for details (test_encoding_charset.py, line 59)
ERROR: Error detected when running the Python tests.
ERROR: Error detected when running the Python tests.
Build step 'Execute shell' marked build as failure

Reply | Threaded
Open this post in threaded view
|

Build failed in Jenkins: pgadmin4-master-python26 #957

pgAdmin 4 Jenkins
See <https://jenkins.pgadmin.org/job/pgadmin4-master-python26/957/display/redirect?page=changes>

Changes:

[Dave Page] Ensure the browser toolbar buttons work in languages other than English.

------------------------------------------
[...truncated 24.77 KB...]
  Cache entry deserialization failed, entry ignored
  Using cached https://files.pythonhosted.org/packages/f0/de/b0b5b98c0f38fd7086d082c47fcb455eedd39a044abe7c595f5f40cd6eed/testscenarios-0.5.0.tar.gz
Requirement already satisfied: testtools==2.3.0 in ./pgadmin-venv/lib/python2.6/site-packages (from -r web/regression/requirements.txt (line 12))
Requirement already satisfied: traceback2==1.4.0 in ./pgadmin-venv/lib/python2.6/site-packages (from -r web/regression/requirements.txt (line 13))
Requirement already satisfied: unittest2==1.1.0 in ./pgadmin-venv/lib/python2.6/site-packages (from -r web/regression/requirements.txt (line 14))
Collecting selenium==3.3.3 (from -r web/regression/requirements.txt (line 24))
  Cache entry deserialization failed, entry ignored
  Using cached https://files.pythonhosted.org/packages/0c/2d/6c51aceb5ad1f9fa75edc7dd47062af19ae79fe49b70ad0089060fb7ac69/selenium-3.3.3.tar.gz
Collecting mock===2.0.0 (from -r web/regression/requirements.txt (line 29))
  Cache entry deserialization failed, entry ignored
  Using cached https://files.pythonhosted.org/packages/0c/53/014354fc93c591ccc4abff12c473ad565a2eb24dcd82490fae33dbf2539f/mock-2.0.0.tar.gz
Collecting chromedriver_installer==0.0.6 (from -r web/regression/requirements.txt (line 33))
  Cache entry deserialization failed, entry ignored
  Using cached https://files.pythonhosted.org/packages/c8/01/0a8a725bb605f68923aba16099a01cbbfe547c8b7dc96fd9a554424f6524/chromedriver_installer-0.0.6.tar.gz
Requirement already satisfied: click>=2.0 in ./pgadmin-venv/lib/python2.6/site-packages (from Flask==0.12.4->-r web/regression/../../requirements.txt (line 9))
Requirement already satisfied: Jinja2>=2.4 in ./pgadmin-venv/lib/python2.6/site-packages (from Flask==0.12.4->-r web/regression/../../requirements.txt (line 9))
Requirement already satisfied: Werkzeug>=0.7 in ./pgadmin-venv/lib/python2.6/site-packages (from Flask==0.12.4->-r web/regression/../../requirements.txt (line 9))
Requirement already satisfied: itsdangerous>=0.21 in ./pgadmin-venv/lib/python2.6/site-packages (from Flask==0.12.4->-r web/regression/../../requirements.txt (line 9))
Requirement already satisfied: alembic>=0.6 in ./pgadmin-venv/lib/python2.6/site-packages (from Flask-Migrate==2.1.1->-r web/regression/../../requirements.txt (line 13))
Requirement already satisfied: webencodings in ./pgadmin-venv/lib/python2.6/site-packages (from html5lib==1.0.1->-r web/regression/../../requirements.txt (line 17))
Requirement already satisfied: Babel>=1.0 in ./pgadmin-venv/lib/python2.6/site-packages (from Flask-BabelEx==0.9.3->-r web/regression/../../requirements.txt (line 59))
Requirement already satisfied: argparse in ./pgadmin-venv/lib/python2.6/site-packages (from unittest2==1.1.0->-r web/regression/requirements.txt (line 14))
Collecting funcsigs>=1 (from mock===2.0.0->-r web/regression/requirements.txt (line 29))
  Cache entry deserialization failed, entry ignored
  Using cached https://files.pythonhosted.org/packages/94/4a/db842e7a0545de1cdb0439bb80e6e42dfe82aaeaadd4072f2263a4fbed23/funcsigs-1.0.2.tar.gz
Requirement already satisfied: MarkupSafe>=0.23 in ./pgadmin-venv/lib/python2.6/site-packages (from Jinja2>=2.4->Flask==0.12.4->-r web/regression/../../requirements.txt (line 9))
Requirement already satisfied: Mako in ./pgadmin-venv/lib/python2.6/site-packages (from alembic>=0.6->Flask-Migrate==2.1.1->-r web/regression/../../requirements.txt (line 13))
Requirement already satisfied: python-editor>=0.3 in ./pgadmin-venv/lib/python2.6/site-packages (from alembic>=0.6->Flask-Migrate==2.1.1->-r web/regression/../../requirements.txt (line 13))
Skipping bdist_wheel for pycodestyle, due to binaries being disabled for it.
Skipping bdist_wheel for pyperclip, due to binaries being disabled for it.
Skipping bdist_wheel for testscenarios, due to binaries being disabled for it.
Skipping bdist_wheel for selenium, due to binaries being disabled for it.
Skipping bdist_wheel for mock, due to binaries being disabled for it.
Skipping bdist_wheel for chromedriver-installer, due to binaries being disabled for it.
Skipping bdist_wheel for funcsigs, due to binaries being disabled for it.
Installing collected packages: pycodestyle, pyperclip, testscenarios, selenium, funcsigs, mock, chromedriver-installer
  Running setup.py install for pycodestyle: started
    Running setup.py install for pycodestyle: finished with status 'done'
  Running setup.py install for pyperclip: started
    Running setup.py install for pyperclip: finished with status 'done'
  Running setup.py install for testscenarios: started
    Running setup.py install for testscenarios: finished with status 'done'
  Running setup.py install for selenium: started
    Running setup.py install for selenium: finished with status 'done'
  Running setup.py install for funcsigs: started
    Running setup.py install for funcsigs: finished with status 'done'
  Running setup.py install for mock: started
    Running setup.py install for mock: finished with status 'done'
  Running setup.py install for chromedriver-installer: started
    Running setup.py install for chromedriver-installer: finished with status 'done'
Successfully installed chromedriver-installer-0.0.6 funcsigs-1.0.2 mock-2.0.0 pycodestyle-2.3.1 pyperclip-1.6.5 selenium-3.3.3 testscenarios-0.5.0
You are using pip version 9.0.3, however version 18.1 is available.
You should consider upgrading via the 'pip install --upgrade pip' command.
Running PEP-8 checks...

cd web && pycodestyle --config=.pycodestyle .
Running regression tests...

<https://jenkins.pgadmin.org/job/pgadmin4-master-python26/ws/pgadmin-venv/lib/python2.6/site-packages/flask_security/forms.py>:67: DeprecationWarning: Required is going away in WTForms 3.0, use DataRequired
  email_required = Required(message='EMAIL_NOT_PROVIDED')
<https://jenkins.pgadmin.org/job/pgadmin4-master-python26/ws/pgadmin-venv/lib/python2.6/site-packages/flask_security/forms.py>:69: DeprecationWarning: Required is going away in WTForms 3.0, use DataRequired
  password_required = Required(message='PASSWORD_NOT_PROVIDED')
2018-12-06 09:27:38,193: INFO pgadmin: ########################################################
2018-12-06 09:27:38,193: INFO pgadmin: Starting pgAdmin 4 v3.6...
2018-12-06 09:27:38,194: INFO pgadmin: ########################################################
2018-12-06 09:27:38,194: DEBUG pgadmin: Python syspath: ['<https://jenkins.pgadmin.org/job/pgadmin4-master-python26/ws/web/regression',> '<https://jenkins.pgadmin.org/job/pgadmin4-master-python26/ws/web',> '<https://jenkins.pgadmin.org/job/pgadmin4-master-python26/ws/web/regression',> '<https://jenkins.pgadmin.org/job/pgadmin4-master-python26/ws/pgadmin-venv/lib/python26.zip',> '<https://jenkins.pgadmin.org/job/pgadmin4-master-python26/ws/pgadmin-venv/lib/python2.6',> '<https://jenkins.pgadmin.org/job/pgadmin4-master-python26/ws/pgadmin-venv/lib/python2.6/plat-linux3',> '<https://jenkins.pgadmin.org/job/pgadmin4-master-python26/ws/pgadmin-venv/lib/python2.6/lib-tk',> '<https://jenkins.pgadmin.org/job/pgadmin4-master-python26/ws/pgadmin-venv/lib/python2.6/lib-old',> '<https://jenkins.pgadmin.org/job/pgadmin4-master-python26/ws/pgadmin-venv/lib/python2.6/lib-dynload',> '/usr/local/python-2.6/lib/python2.6', '/usr/local/python-2.6/lib/python2.6/plat-linux3', '/usr/local/python-2.6/lib/python2.6/lib-tk', '<https://jenkins.pgadmin.org/job/pgadmin4-master-python26/ws/pgadmin-venv/lib/python2.6/site-packages']>
2018-12-06 09:27:38,194: DEBUG pgadmin: Available translations: [Locale('pl'), Locale('zh'), Locale('de'), Locale('ja'), Locale('ru'), Locale('fr'), Locale('ko'), Locale('es')]
<https://jenkins.pgadmin.org/job/pgadmin4-master-python26/ws/pgadmin-venv/lib/python2.6/site-packages/flask_security/utils.py>:151: DeprecationWarning: the method passlib.context.CryptContext.encrypt() is deprecated as of Passlib 1.7, and will be removed in Passlib 2.0, use CryptContext.hash() instead.
  return _pwd_context.encrypt(signed)
2018-12-06 09:27:38,750: INFO pgadmin: Examining potential module: pgadmin.about
2018-12-06 09:27:38,751: INFO pgadmin: Registering blueprint module: <pgadmin.about.AboutModule object at 0x432fb10>
2018-12-06 09:27:38,752: INFO pgadmin: Examining potential module: pgadmin.browser
2018-12-06 09:27:38,752: INFO pgadmin: Registering blueprint module: <pgadmin.browser.BrowserModule object at 0x393c250>
2018-12-06 09:27:38,752: INFO pgadmin: Examining potential module: pgadmin.browser.collection
2018-12-06 09:27:38,752: INFO pgadmin: Examining potential module: pgadmin.browser.register_browser_preferences
2018-12-06 09:27:38,753: INFO pgadmin: Examining potential module: pgadmin.browser.server_groups
2018-12-06 09:27:38,753: INFO pgadmin: Examining potential module: pgadmin.browser.tests
2018-12-06 09:27:38,753: INFO pgadmin: Examining potential module: pgadmin.browser.utils
2018-12-06 09:27:38,755: INFO pgadmin: Examining potential module: pgadmin.browser.server_groups.servers
2018-12-06 09:27:38,755: INFO pgadmin: Examining potential module: pgadmin.browser.server_groups.tests
2018-12-06 09:27:38,759: INFO pgadmin: Examining potential module: pgadmin.browser.server_groups.servers.databases
2018-12-06 09:27:38,759: INFO pgadmin: Examining potential module: pgadmin.browser.server_groups.servers.gpdb
2018-12-06 09:27:38,760: INFO pgadmin: Examining potential module: pgadmin.browser.server_groups.servers.pgagent
2018-12-06 09:27:38,763: INFO pgadmin: Examining potential module: pgadmin.browser.server_groups.servers.ppas
2018-12-06 09:27:38,764: INFO pgadmin: Examining potential module: pgadmin.browser.server_groups.servers.resource_groups
2018-12-06 09:27:38,767: INFO pgadmin: Examining potential module: pgadmin.browser.server_groups.servers.roles
2018-12-06 09:27:38,767: INFO pgadmin: Examining potential module: pgadmin.browser.server_groups.servers.tablespaces
2018-12-06 09:27:38,767: INFO pgadmin: Examining potential module: pgadmin.browser.server_groups.servers.tests
2018-12-06 09:27:38,768: INFO pgadmin: Examining potential module: pgadmin.browser.server_groups.servers.types
2018-12-06 09:27:38,768: INFO pgadmin: Examining potential module: pgadmin.browser.server_groups.servers.utils
2018-12-06 09:27:38,774: INFO pgadmin: Examining potential module: pgadmin.browser.server_groups.servers.databases.casts
2018-12-06 09:27:38,778: INFO pgadmin: Examining potential module: pgadmin.browser.server_groups.servers.databases.event_triggers
2018-12-06 09:27:38,781: INFO pgadmin: Examining potential module: pgadmin.browser.server_groups.servers.databases.extensions
2018-12-06 09:27:38,784: INFO pgadmin: Examining potential module: pgadmin.browser.server_groups.servers.databases.external_tables
2018-12-06 09:27:38,789: INFO pgadmin: Examining potential module: pgadmin.browser.server_groups.servers.databases.foreign_data_wrappers
2018-12-06 09:27:38,793: INFO pgadmin: Examining potential module: pgadmin.browser.server_groups.servers.databases.languages
2018-12-06 09:27:38,797: INFO pgadmin: Examining potential module: pgadmin.browser.server_groups.servers.databases.schemas
2018-12-06 09:27:38,797: INFO pgadmin: Examining potential module: pgadmin.browser.server_groups.servers.databases.tests
2018-12-06 09:27:38,797: INFO pgadmin: Examining potential module: pgadmin.browser.server_groups.servers.databases.utils
2018-12-06 09:27:38,805: INFO pgadmin: Examining potential module: pgadmin.browser.server_groups.servers.databases.casts.tests
2018-12-06 09:27:38,813: INFO pgadmin: Examining potential module: pgadmin.browser.server_groups.servers.databases.event_triggers.tests
2018-12-06 09:27:38,819: INFO pgadmin: Examining potential module: pgadmin.browser.server_groups.servers.databases.extensions.tests
2018-12-06 09:27:38,827: INFO pgadmin: Examining potential module: pgadmin.browser.server_groups.servers.databases.external_tables.actions
2018-12-06 09:27:38,827: INFO pgadmin: Examining potential module: pgadmin.browser.server_groups.servers.databases.external_tables.mapping_utils
2018-12-06 09:27:38,827: INFO pgadmin: Examining potential module: pgadmin.browser.server_groups.servers.databases.external_tables.properties
2018-12-06 09:27:38,827: INFO pgadmin: Examining potential module: pgadmin.browser.server_groups.servers.databases.external_tables.reverse_engineer_ddl
2018-12-06 09:27:38,828: INFO pgadmin: Examining potential module: pgadmin.browser.server_groups.servers.databases.external_tables.tests
2018-12-06 09:27:38,831: INFO pgadmin: Examining potential module: pgadmin.browser.server_groups.servers.databases.foreign_data_wrappers.foreign_servers
2018-12-06 09:27:38,836: INFO pgadmin: Examining potential module: pgadmin.browser.server_groups.servers.databases.foreign_data_wrappers.tests
2018-12-06 09:27:38,844: INFO pgadmin: Examining potential module: pgadmin.browser.server_groups.servers.databases.foreign_data_wrappers.foreign_servers.tests
2018-12-06 09:27:38,844: INFO pgadmin: Examining potential module: pgadmin.browser.server_groups.servers.databases.foreign_data_wrappers.foreign_servers.user_mapping
2018-12-06 09:27:38,855: INFO pgadmin: Examining potential module: pgadmin.browser.server_groups.servers.databases.foreign_data_wrappers.foreign_servers.user_mapping.tests
2018-12-06 09:27:38,864: INFO pgadmin: Examining potential module: pgadmin.browser.server_groups.servers.databases.languages.tests
2018-12-06 09:27:38,870: INFO pgadmin: Examining potential module: pgadmin.browser.server_groups.servers.databases.schemas.catalog_objects
2018-12-06 09:27:38,872: INFO pgadmin: Examining potential module: pgadmin.browser.server_groups.servers.databases.schemas.collations
2018-12-06 09:27:38,876: INFO pgadmin: Examining potential module: pgadmin.browser.server_groups.servers.databases.schemas.domains
2018-12-06 09:27:38,880: INFO pgadmin: Examining potential module: pgadmin.browser.server_groups.servers.databases.schemas.foreign_tables
2018-12-06 09:27:38,887: INFO pgadmin: Examining potential module: pgadmin.browser.server_groups.servers.databases.schemas.fts_configurations
2018-12-06 09:27:38,891: INFO pgadmin: Examining potential module: pgadmin.browser.server_groups.servers.databases.schemas.fts_dictionaries
2018-12-06 09:27:38,895: INFO pgadmin: Examining potential module: pgadmin.browser.server_groups.servers.databases.schemas.fts_parser
2018-12-06 09:27:38,899: INFO pgadmin: Examining potential module: pgadmin.browser.server_groups.servers.databases.schemas.fts_templates
2018-12-06 09:27:38,903: INFO pgadmin: Examining potential module: pgadmin.browser.server_groups.servers.databases.schemas.functions
2018-12-06 09:27:38,903: INFO pgadmin: Examining potential module: pgadmin.browser.server_groups.servers.databases.schemas.packages
2018-12-06 09:27:38,907: INFO pgadmin: Examining potential module: pgadmin.browser.server_groups.servers.databases.schemas.sequences
2018-12-06 09:27:38,912: INFO pgadmin: Examining potential module: pgadmin.browser.server_groups.servers.databases.schemas.synonyms
2018-12-06 09:27:38,915: INFO pgadmin: Examining potential module: pgadmin.browser.server_groups.servers.databases.schemas.tables
2018-12-06 09:27:38,935: INFO pgadmin: Examining potential module: pgadmin.browser.server_groups.servers.databases.schemas.tests
2018-12-06 09:27:38,935: INFO pgadmin: Examining potential module: pgadmin.browser.server_groups.servers.databases.schemas.types
2018-12-06 09:27:38,942: INFO pgadmin: Examining potential module: pgadmin.browser.server_groups.servers.databases.schemas.utils
2018-12-06 09:27:38,942: INFO pgadmin: Examining potential module: pgadmin.browser.server_groups.servers.databases.schemas.views
2018-12-06 09:27:38,956: INFO pgadmin: Examining potential module: pgadmin.browser.server_groups.servers.databases.schemas.catalog_objects.columns
2018-12-06 09:27:38,968: INFO pgadmin: Examining potential module: pgadmin.browser.server_groups.servers.databases.schemas.collations.tests
2018-12-06 09:27:38,976: INFO pgadmin: Examining potential module: pgadmin.browser.server_groups.servers.databases.schemas.domains.domain_constraints
2018-12-06 09:27:38,980: INFO pgadmin: Examining potential module: pgadmin.browser.server_groups.servers.databases.schemas.domains.tests
2018-12-06 09:27:38,996: INFO pgadmin: Examining potential module: pgadmin.browser.server_groups.servers.databases.schemas.foreign_tables.tests
2018-12-06 09:27:39,010: INFO pgadmin: Examining potential module: pgadmin.browser.server_groups.servers.databases.schemas.fts_configurations.tests
2018-12-06 09:27:39,022: INFO pgadmin: Examining potential module: pgadmin.browser.server_groups.servers.databases.schemas.fts_dictionaries.tests
2018-12-06 09:27:39,031: INFO pgadmin: Examining potential module: pgadmin.browser.server_groups.servers.databases.schemas.fts_parser.tests
2018-12-06 09:27:39,044: INFO pgadmin: Examining potential module: pgadmin.browser.server_groups.servers.databases.schemas.fts_templates.tests
2018-12-06 09:27:39,053: INFO pgadmin: Examining potential module: pgadmin.browser.server_groups.servers.databases.schemas.functions.tests
2018-12-06 09:27:39,064: INFO pgadmin: Examining potential module: pgadmin.browser.server_groups.servers.databases.schemas.functions.tests
2018-12-06 09:27:39,075: INFO pgadmin: Examining potential module: pgadmin.browser.server_groups.servers.databases.schemas.functions.tests
2018-12-06 09:27:39,087: INFO pgadmin: Examining potential module: pgadmin.browser.server_groups.servers.databases.schemas.packages.edbfuncs
2018-12-06 09:27:39,090: INFO pgadmin: Examining potential module: pgadmin.browser.server_groups.servers.databases.schemas.packages.edbvars
2018-12-06 09:27:39,092: INFO pgadmin: Examining potential module: pgadmin.browser.server_groups.servers.databases.schemas.packages.tests
2018-12-06 09:27:39,100: INFO pgadmin: Examining potential module: pgadmin.browser.server_groups.servers.databases.schemas.packages.edbfuncs.tests
2018-12-06 09:27:39,105: INFO pgadmin: Examining potential module: pgadmin.browser.server_groups.servers.databases.schemas.packages.edbfuncs.tests
2018-12-06 09:27:39,113: INFO pgadmin: Examining potential module: pgadmin.browser.server_groups.servers.databases.schemas.sequences.tests
2018-12-06 09:27:39,121: INFO pgadmin: Examining potential module: pgadmin.browser.server_groups.servers.databases.schemas.synonyms.tests
2018-12-06 09:27:39,129: INFO pgadmin: Examining potential module: pgadmin.browser.server_groups.servers.databases.schemas.tables.base_partition_table
2018-12-06 09:27:39,129: INFO pgadmin: Examining potential module: pgadmin.browser.server_groups.servers.databases.schemas.tables.column
2018-12-06 09:27:39,134: INFO pgadmin: Examining potential module: pgadmin.browser.server_groups.servers.databases.schemas.tables.constraints
2018-12-06 09:27:39,136: INFO pgadmin: Examining potential module: pgadmin.browser.server_groups.servers.databases.schemas.tables.indexes
2018-12-06 09:27:39,145: INFO pgadmin: Examining potential module: pgadmin.browser.server_groups.servers.databases.schemas.tables.partitions
2018-12-06 09:27:39,145: INFO pgadmin: Examining potential module: pgadmin.browser.server_groups.servers.databases.schemas.tables.rules
2018-12-06 09:27:39,149: INFO pgadmin: Examining potential module: pgadmin.browser.server_groups.servers.databases.schemas.tables.tests
2018-12-06 09:27:39,149: INFO pgadmin: Examining potential module: pgadmin.browser.server_groups.servers.databases.schemas.tables.triggers
2018-12-06 09:27:39,154: INFO pgadmin: Examining potential module: pgadmin.browser.server_groups.servers.databases.schemas.tables.utils
2018-12-06 09:27:39,175: INFO pgadmin: Examining potential module: pgadmin.browser.server_groups.servers.databases.schemas.tables.column.tests
2018-12-06 09:27:39,182: INFO pgadmin: Examining potential module: pgadmin.browser.server_groups.servers.databases.schemas.tables.constraints.check_constraint
2018-12-06 09:27:39,187: INFO pgadmin: Examining potential module: pgadmin.browser.server_groups.servers.databases.schemas.tables.constraints.exclusion_constraint
2018-12-06 09:27:39,193: INFO pgadmin: Examining potential module: pgadmin.browser.server_groups.servers.databases.schemas.tables.constraints.foreign_key
2018-12-06 09:27:39,200: INFO pgadmin: Examining potential module: pgadmin.browser.server_groups.servers.databases.schemas.tables.constraints.index_constraint
2018-12-06 09:27:39,207: INFO pgadmin: Examining potential module: pgadmin.browser.server_groups.servers.databases.schemas.tables.constraints.tests
2018-12-06 09:27:39,207: INFO pgadmin: Examining potential module: pgadmin.browser.server_groups.servers.databases.schemas.tables.constraints.type
2018-12-06 09:27:39,209: INFO pgadmin: Examining potential module: pgadmin.browser.server_groups.servers.databases.schemas.tables.constraints.check_constraint.tests
2018-12-06 09:27:39,253: INFO pgadmin: Examining potential module: pgadmin.browser.server_groups.servers.databases.schemas.tables.indexes.tests
2018-12-06 09:27:39,265: INFO pgadmin: Examining potential module: pgadmin.browser.server_groups.servers.databases.schemas.tables.partitions.tests
2018-12-06 09:27:39,265: INFO pgadmin: Examining potential module: pgadmin.browser.server_groups.servers.databases.schemas.tables.partitions.tests
2018-12-06 09:27:39,271: INFO pgadmin: Examining potential module: pgadmin.browser.server_groups.servers.databases.schemas.tables.rules.tests
2018-12-06 09:27:39,280: INFO pgadmin: Examining potential module: pgadmin.browser.server_groups.servers.databases.schemas.tables.triggers.tests
2018-12-06 09:27:39,290: INFO pgadmin: Examining potential module: pgadmin.browser.server_groups.servers.databases.schemas.types.tests
2018-12-06 09:27:39,304: INFO pgadmin: Examining potential module: pgadmin.browser.server_groups.servers.databases.schemas.views.children
2018-12-06 09:27:39,305: INFO pgadmin: Examining potential module: pgadmin.browser.server_groups.servers.databases.schemas.views.tests
2018-12-06 09:27:39,353: INFO pgadmin: Examining potential module: pgadmin.browser.server_groups.servers.databases.schemas.views.children
2018-12-06 09:27:39,353: INFO pgadmin: Examining potential module: pgadmin.browser.server_groups.servers.databases.schemas.views.tests
2018-12-06 09:27:39,402: INFO pgadmin: Examining potential module: pgadmin.browser.server_groups.servers.databases.schemas.catalog_objects
2018-12-06 09:27:39,402: INFO pgadmin: Examining potential module: pgadmin.browser.server_groups.servers.databases.schemas.collations
2018-12-06 09:27:39,402: INFO pgadmin: Examining potential module: pgadmin.browser.server_groups.servers.databases.schemas.domains
2018-12-06 09:27:39,402: INFO pgadmin: Examining potential module: pgadmin.browser.server_groups.servers.databases.schemas.foreign_tables
2018-12-06 09:27:39,402: INFO pgadmin: Examining potential module: pgadmin.browser.server_groups.servers.databases.schemas.fts_configurations
2018-12-06 09:27:39,403: INFO pgadmin: Examining potential module: pgadmin.browser.server_groups.servers.databases.schemas.fts_dictionaries
2018-12-06 09:27:39,403: INFO pgadmin: Examining potential module: pgadmin.browser.server_groups.servers.databases.schemas.fts_parser
2018-12-06 09:27:39,403: INFO pgadmin: Examining potential module: pgadmin.browser.server_groups.servers.databases.schemas.fts_templates
2018-12-06 09:27:39,403: INFO pgadmin: Examining potential module: pgadmin.browser.server_groups.servers.databases.schemas.functions
2018-12-06 09:27:39,403: INFO pgadmin: Examining potential module: pgadmin.browser.server_groups.servers.databases.schemas.packages
2018-12-06 09:27:39,403: INFO pgadmin: Examining potential module: pgadmin.browser.server_groups.servers.databases.schemas.sequences
2018-12-06 09:27:39,404: INFO pgadmin: Examining potential module: pgadmin.browser.server_groups.servers.databases.schemas.synonyms
2018-12-06 09:27:39,404: INFO pgadmin: Examining potential module: pgadmin.browser.server_groups.servers.databases.schemas.tables
2018-12-06 09:27:39,404: INFO pgadmin: Examining potential module: pgadmin.browser.server_groups.servers.databases.schemas.tests
2018-12-06 09:27:39,404: INFO pgadmin: Examining potential module: pgadmin.browser.server_groups.servers.databases.schemas.types
2018-12-06 09:27:39,404: INFO pgadmin: Examining potential module: pgadmin.browser.server_groups.servers.databases.schemas.utils
2018-12-06 09:27:39,405: INFO pgadmin: Examining potential module: pgadmin.browser.server_groups.servers.databases.schemas.views
2018-12-06 09:27:39,947: INFO pgadmin: Examining potential module: pgadmin.browser.server_groups.servers.pgagent.schedules
2018-12-06 09:27:39,951: INFO pgadmin: Examining potential module: pgadmin.browser.server_groups.servers.pgagent.steps
2018-12-06 09:27:39,954: INFO pgadmin: Examining potential module: pgadmin.browser.server_groups.servers.pgagent.tests
2018-12-06 09:27:39,966: INFO pgadmin: Examining potential module: pgadmin.browser.server_groups.servers.resource_groups.tests
2018-12-06 09:27:39,971: INFO pgadmin: Examining potential module: pgadmin.browser.server_groups.servers.roles.tests
2018-12-06 09:27:39,976: INFO pgadmin: Examining potential module: pgadmin.browser.server_groups.servers.tablespaces.tests
2018-12-06 09:27:39,982: INFO pgadmin: Examining potential module: pgadmin.dashboard
2018-12-06 09:27:39,985: INFO pgadmin: Registering blueprint module: <pgadmin.dashboard.DashboardModule object at 0x5538150>
2018-12-06 09:27:39,985: INFO pgadmin: Examining potential module: pgadmin.dashboard.tests
2018-12-06 09:27:39,994: INFO pgadmin: Examining potential module: pgadmin.feature_tests
2018-12-06 09:27:39,994: INFO pgadmin: Examining potential module: pgadmin.help
2018-12-06 09:27:39,995: INFO pgadmin: Registering blueprint module: <pgadmin.help.HelpModule object at 0x54cc690>
2018-12-06 09:27:39,995: INFO pgadmin: Examining potential module: pgadmin.misc
2018-12-06 09:27:39,996: INFO pgadmin: Registering blueprint module: <pgadmin.misc.MiscModule object at 0x54ccd10>
2018-12-06 09:27:39,997: INFO pgadmin: Examining potential module: pgadmin.misc.bgprocess
2018-12-06 09:27:40,021: INFO pgadmin: Examining potential module: pgadmin.misc.depends
2018-12-06 09:27:40,022: INFO pgadmin: Examining potential module: pgadmin.misc.file_manager
2018-12-06 09:27:40,029: INFO pgadmin: Examining potential module: pgadmin.misc.sql
2018-12-06 09:27:40,030: INFO pgadmin: Examining potential module: pgadmin.misc.statistics
2018-12-06 09:27:40,031: INFO pgadmin: Examining potential module: pgadmin.misc.bgprocess.process_executor
2018-12-06 09:27:40,034: INFO pgadmin: Examining potential module: pgadmin.misc.bgprocess.processes
2018-12-06 09:27:40,040: INFO pgadmin: Examining potential module: pgadmin.model
2018-12-06 09:27:40,040: INFO pgadmin: Examining potential module: pgadmin.preferences
2018-12-06 09:27:40,042: INFO pgadmin: Registering blueprint module: <pgadmin.preferences.PreferencesModule object at 0x55eee90>
2018-12-06 09:27:40,043: INFO pgadmin: Examining potential module: pgadmin.redirects
2018-12-06 09:27:40,044: INFO pgadmin: Registering blueprint module: <pgadmin.utils.PgAdminModule object at 0x55f9650>
2018-12-06 09:27:40,045: INFO pgadmin: Examining potential module: pgadmin.settings
2018-12-06 09:27:40,045: INFO pgadmin: Registering blueprint module: <pgadmin.settings.SettingsModule object at 0x38bbb50>
2018-12-06 09:27:40,047: INFO pgadmin: Examining potential module: pgadmin.setup
2018-12-06 09:27:40,047: INFO pgadmin: Examining potential module: pgadmin.tools
2018-12-06 09:27:40,048: INFO pgadmin: Registering blueprint module: <pgadmin.tools.ToolsModule object at 0x55f9f90>
2018-12-06 09:27:40,048: INFO pgadmin: Examining potential module: pgadmin.tools.backup
2018-12-06 09:27:40,051: INFO pgadmin: Examining potential module: pgadmin.tools.datagrid
2018-12-06 09:27:40,111: INFO pgadmin: Examining potential module: pgadmin.tools.debugger
2018-12-06 09:27:40,120: INFO pgadmin: Examining potential module: pgadmin.tools.grant_wizard
2018-12-06 09:27:40,123: INFO pgadmin: Examining potential module: pgadmin.tools.import_export
2018-12-06 09:27:40,125: INFO pgadmin: Examining potential module: pgadmin.tools.maintenance
2018-12-06 09:27:40,127: INFO pgadmin: Examining potential module: pgadmin.tools.restore
2018-12-06 09:27:40,131: INFO pgadmin: Examining potential module: pgadmin.tools.sqleditor
2018-12-06 09:27:40,131: INFO pgadmin: Examining potential module: pgadmin.tools.user_management
2018-12-06 09:27:40,134: INFO pgadmin: Examining potential module: pgadmin.tools.backup.tests
2018-12-06 09:27:40,149: INFO pgadmin: Examining potential module: pgadmin.tools.import_export.tests
2018-12-06 09:27:40,150: INFO pgadmin: Examining potential module: pgadmin.tools.maintenance.tests
2018-12-06 09:27:40,152: INFO pgadmin: Examining potential module: pgadmin.tools.restore.tests
2018-12-06 09:27:40,154: INFO pgadmin: Examining potential module: pgadmin.tools.sqleditor.command
2018-12-06 09:27:40,154: INFO pgadmin: Examining potential module: pgadmin.tools.sqleditor.tests
2018-12-06 09:27:40,154: INFO pgadmin: Examining potential module: pgadmin.tools.sqleditor.utils
2018-12-06 09:27:40,162: INFO pgadmin: Examining potential module: pgadmin.utils
NOTE: Configuring authentication for DESKTOP mode.
pgAdmin 4 - Application Initialisation
======================================

Non-ASCII character '\xc5' in file <https://jenkins.pgadmin.org/job/pgadmin4-master-python26/ws/web/pgadmin/tools/sqleditor/tests/test_encoding_charset.py> on line 59, but no encoding declared; see http://www.python.org/peps/pep-0263.html for details (test_encoding_charset.py, line 59)
ERROR: Error detected when running the Python tests.
ERROR: Error detected when running the Python tests.
Build step 'Execute shell' marked build as failure

Reply | Threaded
Open this post in threaded view
|

Build failed in Jenkins: pgadmin4-master-python26 #958

pgAdmin 4 Jenkins
See <https://jenkins.pgadmin.org/job/pgadmin4-master-python26/958/display/redirect?page=changes>

Changes:

[Dave Page] Remove blank messages from the Qt project file as they don't work on

[Dave Page] Fix encoding test for older Python versions.

[Dave Page] Use nullptr instead of NULL or 0.

------------------------------------------
[...truncated 1.03 MB...]
copying images... [ 41%] images/clear_saved_password.png
copying images... [ 41%] images/procedure_general.png
copying images... [ 41%] images/event_trigger_security.png
copying images... [ 41%] images/preferences_paths_binary.png
copying images... [ 42%] images/primary_key_sql.png
copying images... [ 42%] images/foreign_server_definition.png
copying images... [ 42%] images/domain_constraint_sql.png
copying images... [ 43%] images/backup_globals_messages.png
copying images... [ 43%] images/domain_sql.png
copying images... [ 43%] images/backup_objects.png
copying images... [ 44%] images/pgagent_properties.png
copying images... [ 44%] images/query_execute_section.png
copying images... [ 44%] images/foreign_server_sql.png
copying images... [ 45%] images/debug_toolbar.png
copying images... [ 45%] images/query_tool_connection_status.png
copying images... [ 45%] images/preferences_browser_display.png
copying images... [ 46%] images/server_connection.png
copying images... [ 46%] images/server_ssl.png
copying images... [ 46%] images/backup_messages.png
copying images... [ 47%] images/debug_main.png
copying images... [ 47%] images/main_statistics.png
copying images... [ 47%] images/backup_server_do_not_save.png
copying images... [ 48%] images/role_security.png
copying images... [ 48%] images/pgagent_schedules.png
copying images... [ 48%] images/user_mapping_options.png
copying images... [ 49%] images/table_advanced.png
copying images... [ 49%] images/backup_sections.png
copying images... [ 49%] images/restore_messages.png
copying images... [ 50%] images/package_code.png
copying images... [ 50%] images/extension_general.png
copying images... [ 50%] images/maintenance.png
copying images... [ 50%] images/tablespace_definition.png
copying images... [ 51%] images/foreign_data_wrapper_general.png
copying images... [ 51%] images/tool_menu.png
copying images... [ 51%] images/foreign_server_options.png
copying images... [ 52%] images/foreign_key_action.png
copying images... [ 52%] images/schema_security.png
copying images... [ 52%] images/type_external.png
copying images... [ 53%] images/materialized_view_sql.png
copying images... [ 53%] images/import_export_miscellaneous.png
copying images... [ 53%] images/ce_not_running.png
copying images... [ 54%] images/language_sql.png
copying images... [ 54%] images/import_export_options.png
copying images... [ 54%] images/primary_key_definition.png
copying images... [ 55%] images/backup_server_queries.png
copying images... [ 55%] images/rule_sql.png
copying images... [ 55%] images/ce_timeout.png
copying images... [ 56%] images/ce_error_hba.png
copying images... [ 56%] images/connect_to_tunneled_server.png
copying images... [ 56%] images/pgadmin_login.png
copying images... [ 57%] images/main_dashboard.png
copying images... [ 57%] images/backup_miscellaneous.png
copying images... [ 57%] images/import_export_columns.png
copying images... [ 58%] images/grant_wizard_step1.png
copying images... [ 58%] images/preferences_dashboard_graphs.png
copying images... [ 58%] images/preferences_sql_options.png
copying images... [ 58%] images/foreign_key_sql.png
copying images... [ 59%] images/tablespace_general.png
copying images... [ 59%] images/column_variables.png
copying images... [ 59%] images/resource_group_sql.png
copying images... [ 60%] images/ce_password_failed.png
copying images... [ 60%] images/foreign_table_general.png
copying images... [ 60%] images/restore_sections.png
copying images... [ 61%] images/preferences_dashboard_display.png
copying images... [ 61%] images/rule_definition.png
copying images... [ 61%] images/column_security.png
copying images... [ 62%] images/move_objects_sql.png
copying images... [ 62%] images/restore_objects.png
copying images... [ 62%] images/sequence_general.png
copying images... [ 63%] images/geometry_viewer.png
copying images... [ 63%] images/server_ssh_tunnel.png
copying images... [ 63%] images/editgrid_toolbar.png
copying images... [ 64%] images/role_membership.png
copying images... [ 64%] images/rule_general.png
copying images... [ 64%] images/fts_configuration_sql.png
copying images... [ 65%] images/preferences_misc_user_language.png
copying images... [ 65%] images/table_partition.png
copying images... [ 65%] images/language_security.png
copying images... [ 66%] images/extension_sql.png
copying images... [ 66%] images/database_general.png
copying images... [ 66%] images/exclusion_constraint_definition.png
copying images... [ 66%] images/domain_constraint_definition.png
copying images... [ 67%] images/query_output_error.png
copying images... [ 67%] images/restore_disable.png
copying images... [ 67%] images/view_definition.png
copying images... [ 68%] images/fts_dictionary_options.png
copying images... [ 68%] images/foreign_table_security.png
copying images... [ 68%] images/primary_key_general.png
copying images... [ 69%] images/extension_definition.png
copying images... [ 69%] images/tablespace_sql.png
copying images... [ 69%] images/procedure_arguments.png
copying images... [ 70%] images/object_menu.png
copying images... [ 70%] images/index_general.png
copying images... [ 70%] images/foreign_table_columns.png
copying images... [ 71%] images/index_definition.png
copying images... [ 71%] images/server_general.png
copying images... [ 71%] images/fts_dictionary_general.png
copying images... [ 72%] images/pgagent_sql.png
copying images... [ 72%] images/main_properties_icons.png
copying images... [ 72%] images/foreign_data_wrapper_definition.png
copying images... [ 73%] images/role_definition.png
copying images... [ 73%] images/procedure_security.png
copying images... [ 73%] images/fts_dictionary_definition.png
copying images... [ 74%] images/fts_template_definition.png
copying images... [ 74%] images/table_exclude.png
copying images... [ 74%] images/clear_tunnel_password.png
copying images... [ 75%] images/cast_definition.png
copying images... [ 75%] images/user_mapping_general.png
copying images... [ 75%] images/table_constraints.png
copying images... [ 75%] images/backup_server_general.png
copying images... [ 76%] images/collation_sql.png
copying images... [ 76%] images/foreign_table_options.png
copying images... [ 76%] images/add_pgadmin_user.png
copying images... [ 77%] images/language_definition.png
copying images... [ 77%] images/pgagent_schedule_definition.png
copying images... [ 77%] images/foreign_key_general.png
copying images... [ 78%] images/table_sql.png
copying images... [ 78%] images/check_definition.png
copying images... [ 78%] images/function_options.png
copying images... [ 79%] images/pgadmin_login_recover.png
copying images... [ 79%] images/type_shell.png
copying images... [ 79%] images/tablespace_parameters.png
copying images... [ 80%] images/change_user_password.png
copying images... [ 80%] images/view_security.png
copying images... [ 80%] images/type_range.png
copying images... [ 81%] images/import_export_complete.png
copying images... [ 81%] images/connect_to_server.png
copying images... [ 81%] images/main_dependencies.png
copying images... [ 82%] images/column_sql.png
copying images... [ 82%] images/tablespace_security.png
copying images... [ 82%] images/backup_queries.png
copying images... [ 83%] images/backup_globals_process_watcher.png
copying images... [ 83%] images/unique_constraint_definition.png
copying images... [ 83%] images/exclusion_constraint_sql.png
copying images... [ 83%] images/logo-right-128.png
copying images... [ 84%] images/geometry_viewer_property_table.png
copying images... [ 84%] images/table_parameter.png
copying images... [ 84%] images/fts_parser_sql.png
copying images... [ 85%] images/debug_stack.png
copying images... [ 85%] images/trigger_function_options.png
copying images... [ 85%] images/database_security.png
copying images... [ 86%] images/domain_general.png
copying images... [ 86%] images/exclusion_constraint_general.png
copying images... [ 86%] images/schema_sql.png
copying images... [ 87%] images/debug_ic_step_in.png
copying images... [ 87%] images/maintenance_complete.png
copying images... [ 87%] images/foreign_table_definition.png
copying images... [ 88%] images/domain_constraint_general.png
copying images... [ 88%] images/debug_step_in.png
copying images... [ 88%] images/preferences_storage_options.png
copying images... [ 89%] images/pgadmin_welcome.png
copying images... [ 89%] images/materialized_view_definition.png
copying images... [ 89%] images/function_definition.png
copying images... [ 90%] images/pgagent_step_definition_code.png
copying images... [ 90%] images/cast_general.png
copying images... [ 90%] images/unique_constraint_general.png
copying images... [ 91%] images/foreign_data_wrapper_options.png
copying images... [ 91%] images/query_tool.png
copying images... [ 91%] images/query_output_data.png
copying images... [ 91%] images/query_output_history.png
copying images... [ 92%] images/database_definition.png
copying images... [ 92%] images/role_privileges.png
copying images... [ 92%] images/preferences_sql_auto_completion.png
copying images... [ 93%] images/help_menu.png
copying images... [ 93%] images/sequence_sql.png
copying images... [ 93%] images/query_tool_message.png
copying images... [ 94%] images/backup_server_disable.png
copying images... [ 94%] images/query_sql_editor.png
copying images... [ 94%] images/preferences_sql_explain.png
copying images... [ 95%] images/query_output_explain.png
copying images... [ 95%] images/unique_constraint_sql.png
copying images... [ 95%] images/add_restore_point.png
copying images... [ 96%] images/fts_configuration_tokens.png
copying images... [ 96%] images/pgadmin_user.png
copying images... [ 96%] images/event_trigger_sql.png
copying images... [ 97%] images/backup_globals_general.png
copying images... [ 97%] images/preferences_debugger_display.png
copying images... [ 97%] images/preferences_browser_properties.png
copying images... [ 98%] images/type_sql.png
copying images... [ 98%] images/procedure_definition.png
copying images... [ 98%] images/package_general.png
copying images... [ 99%] images/file_menu.png
copying images... [ 99%] images/grant_wizard_step2.png
copying images... [ 99%] images/column_definition.png
copying images... [100%] images/backup_server_miscellaneous.png

copying static files... done
copying extra files... done
dumping search index in English (code: en) ... done
dumping object inventory... done
build succeeded.

Build finished. The HTML pages are in _build/html.
make[1]: Leaving directory `<https://jenkins.pgadmin.org/job/pgadmin4-master-python26/ws/docs/en_US'>
EXECUTING: Build runtime - QT4

make: *** No rule to make target `clean'.  Stop.
Project MESSAGE: Building for QT4...
Project MESSAGE: Building for Linux/Mac...
Project MESSAGE: Using /usr/local/python-2.6/bin/python-config
Project MESSAGE: Python2 detected.
/usr/lib64/qt4/bin/uic ConfigWindow.ui -o ui_ConfigWindow.h
/usr/lib64/qt4/bin/uic LogWindow.ui -o ui_LogWindow.h
/usr/lib64/qt4/bin/uic FloatingWindow.ui -o ui_FloatingWindow.h
g++ -c -pipe -I/usr/local/python-2.6/include/python2.6 -I/usr/local/python-2.6/include/python2.6 -O2 -g -pipe -Wall -Wp,-D_FORTIFY_SOURCE=2 -fexceptions -fstack-protector-strong --param=ssp-buffer-size=4 -grecord-gcc-switches -m64 -mtune=generic -O2 -Wall -W -D_REENTRANT -DPYTHON2 -DQT_NO_DEBUG -DQT_GUI_LIB -DQT_NETWORK_LIB -DQT_CORE_LIB -DQT_SHARED -I/usr/lib64/qt4/mkspecs/linux-g++ -I. -I/usr/include/QtCore -I/usr/include/QtNetwork -I/usr/include/QtGui -I/usr/include -I. -I. -o pgAdmin4.o pgAdmin4.cpp
In file included from pgAdmin4.cpp:34:0:
ConfigWindow.h:26:5: warning: identifier ‘nullptr’ is a keyword in C++11 [-Wc++0x-compat]
     explicit ConfigWindow(QWidget *parent = nullptr);
     ^
In file included from /usr/local/python-2.6/include/python2.6/Python.h:58:0,
                 from pgAdmin4.h:20,
                 from pgAdmin4.cpp:12:
/usr/local/python-2.6/include/python2.6/pyport.h:716:76: warning: ‘PyArg_ParseTuple’ is an unrecognized format function type [-Wformat=]
 #define Py_FORMAT_PARSETUPLE(func,p1,p2) __attribute__((format(func,p1,p2)))
                                                                            ^
/usr/local/python-2.6/include/python2.6/modsupport.h:27:65: note: in expansion of macro ‘Py_FORMAT_PARSETUPLE’
 PyAPI_FUNC(int) PyArg_ParseTuple(PyObject *, const char *, ...) Py_FORMAT_PARSETUPLE(PyArg_ParseTuple, 2, 3);
                                                                 ^
In file included from pgAdmin4.cpp:34:0:
ConfigWindow.h:26:45: error: ‘nullptr’ was not declared in this scope
     explicit ConfigWindow(QWidget *parent = nullptr);
                                             ^
In file included from MenuActions.h:18:0,
                 from TrayIcon.h:19,
                 from pgAdmin4.cpp:36:
LogWindow.h:26:42: error: ‘nullptr’ was not declared in this scope
     explicit LogWindow(QWidget *parent = nullptr, QString logFile = "");
                                          ^
In file included from pgAdmin4.cpp:38:0:
FloatingWindow.h:30:47: error: ‘nullptr’ was not declared in this scope
     explicit FloatingWindow(QWidget *parent = nullptr);
                                               ^
pgAdmin4.cpp: In function ‘int main(int, char**)’:
pgAdmin4.cpp:217:23: error: ‘nullptr’ was not declared in this scope
     if(menuActions != nullptr)
                       ^
pgAdmin4.cpp:224:38: error: ‘nullptr’ was not declared in this scope
     FloatingWindow *floatingWindow = nullptr;
                                      ^
pgAdmin4.cpp:242:45: error: call to ‘FloatingWindow::FloatingWindow(QWidget*)’ uses the default argument for parameter 1, which is not yet defined
         floatingWindow = new FloatingWindow();
                                             ^
pgAdmin4.cpp:311:50: error: call to ‘ConfigWindow::ConfigWindow(QWidget*)’ uses the default argument for parameter 1, which is not yet defined
             ConfigWindow *dlg = new ConfigWindow();
                                                  ^
make: *** [pgAdmin4.o] Error 1
ERROR: Failed to build the QT4 runtime.
ERROR: Failed to build the QT4 runtime.
Build step 'Execute shell' marked build as failure

Reply | Threaded
Open this post in threaded view
|

Jenkins build is back to normal : pgadmin4-master-python26 #959

pgAdmin 4 Jenkins