Build failed in Jenkins: pgadmin4-master-python27 #822

classic Classic list List threaded Threaded
9 messages Options
Reply | Threaded
Open this post in threaded view
|

Build failed in Jenkins: pgadmin4-master-python27 #822

pgAdmin 4 Jenkins
See <https://jenkins.pgadmin.org/job/pgadmin4-master-python27/822/display/redirect?page=changes>

Changes:

[Dave Page] Fix an encoding issue in the query tool. Fixes #3711

[Dave Page] Update release notes.

------------------------------------------
[...truncated 749 B...]
 > git config core.sparsecheckout # timeout=10
 > git checkout -f 739864c7d14e1e9e06991ec764209fc6ae2c3943
Commit message: "Update release notes."
 > git rev-list --no-walk 6428ffcdafdc77b6bc5791c9185dfd20a0f5f926 # timeout=10
[EnvInject] - Executing scripts and injecting environment variables after the SCM step.
[EnvInject] - Injecting as environment variables the properties content
PYTHON_VERSION=2.7

[EnvInject] - Variables injected successfully.
[pgadmin4-master-python27] $ /bin/sh -xe /tmp/jenkins8790352257571755409.sh
+ <https://jenkins.pgadmin.org/job/pgadmin4-master-python27/ws/ci/ci_runner.sh>
EXECUTING: Create pgAdmin config

EXECUTING: Python tests

Creating Python 2.7 virtual environment...

New python executable in <https://jenkins.pgadmin.org/job/pgadmin4-master-python27/ws/pgadmin-venv/bin/python>
Installing setuptools, pip, wheel...done.
Running virtualenv with interpreter /usr/local/python-2.7/bin/python
Ignoring psycopg2: markers 'python_version < "2.7"' don't match your environment
Ignoring Flask-Script: markers 'python_version < "2.7"' don't match your environment
Ignoring ordereddict: markers 'python_version < "2.7"' don't match your environment
Ignoring python-dateutil: markers 'python_version < "2.7"' don't match your environment
Ignoring SQLAlchemy: markers 'python_version < "2.7"' don't match your environment
Ignoring Flask-Security: markers 'python_version < "2.7"' don't match your environment
Ignoring Flask-BabelEx: markers 'python_version < "2.7"' don't match your environment
Collecting blinker==1.4 (from -r requirements.txt (line 6))
Collecting extras==1.0.0 (from -r requirements.txt (line 7))
  Using cached https://files.pythonhosted.org/packages/03/e9/e915af1f97914cd0bc021e125fd1bfd4106de614a275e4b6866dd9a209ac/extras-1.0.0-py2.py3-none-any.whl
Collecting fixtures==3.0.0 (from -r requirements.txt (line 8))
  Using cached https://files.pythonhosted.org/packages/a8/28/7eed6bf76792f418029a18d5b2ace87ce7562927cdd00f1cefe481cd148f/fixtures-3.0.0-py2.py3-none-any.whl
Collecting Flask==0.12.4 (from -r requirements.txt (line 9))
  Using cached https://files.pythonhosted.org/packages/2e/48/f1936dadac2326b3d73f2fe0a964a87d16be16eb9d7fc56f09c1bea3d17c/Flask-0.12.4-py2.py3-none-any.whl
Collecting Flask-Gravatar==0.5.0 (from -r requirements.txt (line 10))
  Using cached https://files.pythonhosted.org/packages/58/4a/b20260e8d383d0037f2791dd8a3f3ea729ca9f02d7638677a34a236a8702/Flask_Gravatar-0.5.0-py2.py3-none-any.whl
Collecting Flask-Login==0.3.2 (from -r requirements.txt (line 11))
Collecting Flask-Mail==0.9.1 (from -r requirements.txt (line 12))
Collecting Flask-Migrate==2.1.1 (from -r requirements.txt (line 13))
  Using cached https://files.pythonhosted.org/packages/c6/06/053630cb5fe3974c7d60c2d3f3907bae6ff86beb8720bd4fcf53c45c6702/Flask_Migrate-2.1.1-py2.py3-none-any.whl
Collecting Flask-Principal==0.4.0 (from -r requirements.txt (line 14))
Collecting Flask-SQLAlchemy==2.3.2 (from -r requirements.txt (line 15))
  Using cached https://files.pythonhosted.org/packages/a1/44/294fb7f6bf49cc7224417cd0637018db9fee0729b4fe166e43e2bbb1f1c8/Flask_SQLAlchemy-2.3.2-py2.py3-none-any.whl
Collecting Flask-WTF==0.14.2 (from -r requirements.txt (line 16))
  Using cached https://files.pythonhosted.org/packages/60/3a/58c629472d10539ae5167dc7c1fecfa95dd7d0b7864623931e3776438a24/Flask_WTF-0.14.2-py2.py3-none-any.whl
Collecting html5lib==1.0.1 (from -r requirements.txt (line 17))
  Using cached https://files.pythonhosted.org/packages/a5/62/bbd2be0e7943ec8504b517e62bab011b4946e1258842bc159e5dfde15b96/html5lib-1.0.1-py2.py3-none-any.whl
Collecting linecache2==1.0.0 (from -r requirements.txt (line 18))
  Using cached https://files.pythonhosted.org/packages/c7/a3/c5da2a44c85bfbb6eebcfc1dde24933f8704441b98fdde6528f4831757a6/linecache2-1.0.0-py2.py3-none-any.whl
Collecting passlib==1.7.1 (from -r requirements.txt (line 19))
  Using cached https://files.pythonhosted.org/packages/ee/a7/d6d238d927df355d4e4e000670342ca4705a72f0bf694027cf67d9bcf5af/passlib-1.7.1-py2.py3-none-any.whl
Collecting pbr==3.1.1 (from -r requirements.txt (line 20))
  Using cached https://files.pythonhosted.org/packages/0c/5d/b077dbf309993d52c1d71e6bf6fe443a8029ea215135ebbe0b1b10e7aefc/pbr-3.1.1-py2.py3-none-any.whl
Collecting pycrypto>=2.6.1 (from -r requirements.txt (line 21))
Collecting pyrsistent==0.14.2 (from -r requirements.txt (line 22))
Collecting python-mimeparse==1.6.0 (from -r requirements.txt (line 23))
  Using cached https://files.pythonhosted.org/packages/26/2e/03bce213a9bf02a2750dcb04e761785e9c763fc11071edc4b447eacbb842/python_mimeparse-1.6.0-py2.py3-none-any.whl
Collecting pytz==2018.3 (from -r requirements.txt (line 24))
  Using cached https://files.pythonhosted.org/packages/3c/80/32e98784a8647880dedf1f6bf8e2c91b195fe18fdecc6767dcf5104598d6/pytz-2018.3-py2.py3-none-any.whl
Collecting simplejson==3.13.2 (from -r requirements.txt (line 25))
Collecting six>=1.11.0 (from -r requirements.txt (line 26))
  Using cached https://files.pythonhosted.org/packages/67/4b/141a581104b1f6397bfa78ac9d43d8ad29a7ca43ea90a2d863fe3056e86a/six-1.11.0-py2.py3-none-any.whl
Collecting speaklater==1.3 (from -r requirements.txt (line 27))
Collecting sqlparse==0.2.4 (from -r requirements.txt (line 28))
  Using cached https://files.pythonhosted.org/packages/65/85/20bdd72f4537cf2c4d5d005368d502b2f464ede22982e724a82c86268eda/sqlparse-0.2.4-py2.py3-none-any.whl
Collecting WTForms==2.1 (from -r requirements.txt (line 29))
Collecting Flask-Paranoid==0.2.0 (from -r requirements.txt (line 30))
  Using cached https://files.pythonhosted.org/packages/0e/14/359033a218c5403872e11ff7267e6c638c0279067fa932d93653188f4052/Flask_Paranoid-0.2.0-py2.py3-none-any.whl
Collecting psutil==5.4.7 (from -r requirements.txt (line 31))
Collecting psycopg2>=2.7.4 (from -r requirements.txt (line 36))
  Using cached https://files.pythonhosted.org/packages/34/a5/39f47ab93f85751def5814a8774470fee6e7a2f97fbfd3e685d53c9fbcf1/psycopg2-2.7.6.1-cp27-cp27m-manylinux1_x86_64.whl
Collecting python-dateutil>=2.7.1 (from -r requirements.txt (line 37))
  Using cached https://files.pythonhosted.org/packages/74/68/d87d9b36af36f44254a8d512cbfc48369103a3b9e474be9bdfe536abfc45/python_dateutil-2.7.5-py2.py3-none-any.whl
Collecting htmlmin==0.1.12 (from -r requirements.txt (line 38))
Collecting Flask-HTMLmin==1.3.2 (from -r requirements.txt (line 39))
Collecting SQLAlchemy>=1.2.5 (from -r requirements.txt (line 40))
Collecting Flask-Security>=3.0.0 (from -r requirements.txt (line 41))
  Using cached https://files.pythonhosted.org/packages/88/47/4908a5040120768ff4fb2465c7eeafeb9239c27d2919bd67c4ccc1b43e14/Flask_Security-3.0.0-py2.py3-none-any.whl
Collecting sshtunnel>=0.1.3 (from -r requirements.txt (line 42))
Collecting backports.csv==1.0.5 (from -r requirements.txt (line 47))
  Using cached https://files.pythonhosted.org/packages/23/01/0b1fce3fd8199fe32338dc66747baad52c7183b7f587128bc77cefde0620/backports.csv-1.0.5-py2.py3-none-any.whl
Collecting importlib==1.0.3 (from -r requirements.txt (line 48))
Collecting testtools>=0.9.22 (from fixtures==3.0.0->-r requirements.txt (line 8))
  Using cached https://files.pythonhosted.org/packages/87/74/a4d55da28d7bba6d6f49430f22a62afd8472cb24a63fa61daef80d3e821b/testtools-2.3.0-py2.py3-none-any.whl
Collecting itsdangerous>=0.21 (from Flask==0.12.4->-r requirements.txt (line 9))
  Using cached https://files.pythonhosted.org/packages/76/ae/44b03b253d6fade317f32c24d100b3b35c2239807046a4c953c7b89fa49e/itsdangerous-1.1.0-py2.py3-none-any.whl
Collecting click>=2.0 (from Flask==0.12.4->-r requirements.txt (line 9))
  Using cached https://files.pythonhosted.org/packages/fa/37/45185cb5abbc30d7257104c434fe0b07e5a195a6847506c074527aa599ec/Click-7.0-py2.py3-none-any.whl
Collecting Werkzeug>=0.7 (from Flask==0.12.4->-r requirements.txt (line 9))
  Using cached https://files.pythonhosted.org/packages/20/c4/12e3e56473e52375aa29c4764e70d1b8f3efa6682bef8d0aae04fe335243/Werkzeug-0.14.1-py2.py3-none-any.whl
Collecting Jinja2>=2.4 (from Flask==0.12.4->-r requirements.txt (line 9))
  Using cached https://files.pythonhosted.org/packages/7f/ff/ae64bacdfc95f27a016a7bed8e8686763ba4d277a78ca76f32659220a731/Jinja2-2.10-py2.py3-none-any.whl
Collecting alembic>=0.6 (from Flask-Migrate==2.1.1->-r requirements.txt (line 13))
Collecting webencodings (from html5lib==1.0.1->-r requirements.txt (line 17))
  Using cached https://files.pythonhosted.org/packages/f4/24/2a3e3df732393fed8b3ebf2ec078f05546de641fe1b667ee316ec1dcf3b7/webencodings-0.5.1-py2.py3-none-any.whl
Collecting Flask-BabelEx>=0.9.3 (from Flask-Security>=3.0.0->-r requirements.txt (line 41))
Collecting paramiko>=1.15.2 (from sshtunnel>=0.1.3->-r requirements.txt (line 42))
  Using cached https://files.pythonhosted.org/packages/cf/ae/94e70d49044ccc234bfdba20114fa947d7ba6eb68a2e452d89b920e62227/paramiko-2.4.2-py2.py3-none-any.whl
Collecting unittest2>=1.0.0 (from testtools>=0.9.22->fixtures==3.0.0->-r requirements.txt (line 8))
  Using cached https://files.pythonhosted.org/packages/72/20/7f0f433060a962200b7272b8c12ba90ef5b903e218174301d0abfd523813/unittest2-1.1.0-py2.py3-none-any.whl
Collecting traceback2 (from testtools>=0.9.22->fixtures==3.0.0->-r requirements.txt (line 8))
  Using cached https://files.pythonhosted.org/packages/17/0a/6ac05a3723017a967193456a2efa0aa9ac4b51456891af1e2353bb9de21e/traceback2-1.4.0-py2.py3-none-any.whl
Collecting MarkupSafe>=0.23 (from Jinja2>=2.4->Flask==0.12.4->-r requirements.txt (line 9))
  Using cached https://files.pythonhosted.org/packages/94/7a/34f53c66e0f9070b273c083d674581158426f2670cfd03f07fec375f0325/MarkupSafe-1.1.0-cp27-cp27m-manylinux1_x86_64.whl
Collecting python-editor>=0.3 (from alembic>=0.6->Flask-Migrate==2.1.1->-r requirements.txt (line 13))
Collecting Mako (from alembic>=0.6->Flask-Migrate==2.1.1->-r requirements.txt (line 13))
Collecting Babel>=1.0 (from Flask-BabelEx>=0.9.3->Flask-Security>=3.0.0->-r requirements.txt (line 41))
  Using cached https://files.pythonhosted.org/packages/b8/ad/c6f60602d3ee3d92fbed87675b6fb6a6f9a38c223343ababdb44ba201f10/Babel-2.6.0-py2.py3-none-any.whl
Collecting pynacl>=1.0.1 (from paramiko>=1.15.2->sshtunnel>=0.1.3->-r requirements.txt (line 42))
  Using cached https://files.pythonhosted.org/packages/4a/e6/e6c36a758c3556f92124d39e16ca2afe7408a61d0ffb00c636081f044088/PyNaCl-1.3.0-cp27-cp27m-manylinux1_x86_64.whl
Collecting cryptography>=1.5 (from paramiko>=1.15.2->sshtunnel>=0.1.3->-r requirements.txt (line 42))
  Using cached https://files.pythonhosted.org/packages/1a/06/93bc0c01c61d7845b45e6751640d1ab83132964bfb3e71187acf94dc7193/cryptography-2.4.2-cp27-cp27m-manylinux1_x86_64.whl
Collecting bcrypt>=3.1.3 (from paramiko>=1.15.2->sshtunnel>=0.1.3->-r requirements.txt (line 42))
  Using cached https://files.pythonhosted.org/packages/1c/85/6b367f72c973600c1acac6f5d7fe2f919327e2b688fdb02effa07f6e6c4f/bcrypt-3.1.4-cp27-cp27m-manylinux1_x86_64.whl
Collecting pyasn1>=0.1.7 (from paramiko>=1.15.2->sshtunnel>=0.1.3->-r requirements.txt (line 42))
  Using cached https://files.pythonhosted.org/packages/d1/a1/7790cc85db38daa874f6a2e6308131b9953feb1367f2ae2d1123bb93a9f5/pyasn1-0.4.4-py2.py3-none-any.whl
Collecting argparse (from unittest2>=1.0.0->testtools>=0.9.22->fixtures==3.0.0->-r requirements.txt (line 8))
  Using cached https://files.pythonhosted.org/packages/f2/94/3af39d34be01a24a6e65433d19e107099374224905f1e0cc6bbe1fd22a2f/argparse-1.4.0-py2.py3-none-any.whl
Collecting cffi>=1.4.1 (from pynacl>=1.0.1->paramiko>=1.15.2->sshtunnel>=0.1.3->-r requirements.txt (line 42))
  Using cached https://files.pythonhosted.org/packages/5d/a7/348bf05f004e7534012dc533ee29650d88fb25bf013988518e0acf6961fa/cffi-1.11.5-cp27-cp27m-manylinux1_x86_64.whl
Collecting idna>=2.1 (from cryptography>=1.5->paramiko>=1.15.2->sshtunnel>=0.1.3->-r requirements.txt (line 42))
  Using cached https://files.pythonhosted.org/packages/4b/2a/0276479a4b3caeb8a8c1af2f8e4355746a97fab05a372e4a2c6a6b876165/idna-2.7-py2.py3-none-any.whl
Collecting enum34; python_version < "3" (from cryptography>=1.5->paramiko>=1.15.2->sshtunnel>=0.1.3->-r requirements.txt (line 42))
  Using cached https://files.pythonhosted.org/packages/c5/db/e56e6b4bbac7c4a06de1c50de6fe1ef3810018ae11732a50f15f62c7d050/enum34-1.1.6-py2-none-any.whl
Collecting asn1crypto>=0.21.0 (from cryptography>=1.5->paramiko>=1.15.2->sshtunnel>=0.1.3->-r requirements.txt (line 42))
  Using cached https://files.pythonhosted.org/packages/ea/cd/35485615f45f30a510576f1a56d1e0a7ad7bd8ab5ed7cdc600ef7cd06222/asn1crypto-0.24.0-py2.py3-none-any.whl
Collecting ipaddress; python_version < "3" (from cryptography>=1.5->paramiko>=1.15.2->sshtunnel>=0.1.3->-r requirements.txt (line 42))
  Using cached https://files.pythonhosted.org/packages/fc/d0/7fc3a811e011d4b388be48a0e381db8d990042df54aa4ef4599a31d39853/ipaddress-1.0.22-py2.py3-none-any.whl
Collecting pycparser (from cffi>=1.4.1->pynacl>=1.0.1->paramiko>=1.15.2->sshtunnel>=0.1.3->-r requirements.txt (line 42))
Installing collected packages: blinker, extras, six, argparse, linecache2, traceback2, unittest2, pbr, python-mimeparse, testtools, fixtures, itsdangerous, click, Werkzeug, MarkupSafe, Jinja2, Flask, Flask-Gravatar, Flask-Login, Flask-Mail, python-editor, python-dateutil, Mako, SQLAlchemy, alembic, Flask-SQLAlchemy, Flask-Migrate, Flask-Principal, WTForms, Flask-WTF, webencodings, html5lib, passlib, pycrypto, pyrsistent, pytz, simplejson, speaklater, sqlparse, Flask-Paranoid, psutil, psycopg2, htmlmin, Flask-HTMLmin, Babel, Flask-BabelEx, Flask-Security, pycparser, cffi, pynacl, idna, enum34, asn1crypto, ipaddress, cryptography, bcrypt, pyasn1, paramiko, sshtunnel, backports.csv, importlib
Successfully installed Babel-2.6.0 Flask-0.12.4 Flask-BabelEx-0.9.3 Flask-Gravatar-0.5.0 Flask-HTMLmin-1.3.2 Flask-Login-0.3.2 Flask-Mail-0.9.1 Flask-Migrate-2.1.1 Flask-Paranoid-0.2.0 Flask-Principal-0.4.0 Flask-SQLAlchemy-2.3.2 Flask-Security-3.0.0 Flask-WTF-0.14.2 Jinja2-2.10 Mako-1.0.7 MarkupSafe-1.1.0 SQLAlchemy-1.2.14 WTForms-2.1 Werkzeug-0.14.1 alembic-1.0.5 argparse-1.4.0 asn1crypto-0.24.0 backports.csv-1.0.5 bcrypt-3.1.4 blinker-1.4 cffi-1.11.5 click-7.0 cryptography-2.4.2 enum34-1.1.6 extras-1.0.0 fixtures-3.0.0 html5lib-1.0.1 htmlmin-0.1.12 idna-2.7 importlib-1.0.3 ipaddress-1.0.22 itsdangerous-1.1.0 linecache2-1.0.0 paramiko-2.4.2 passlib-1.7.1 pbr-3.1.1 psutil-5.4.7 psycopg2-2.7.6.1 pyasn1-0.4.4 pycparser-2.19 pycrypto-2.6.1 pynacl-1.3.0 pyrsistent-0.14.2 python-dateutil-2.7.5 python-editor-1.0.3 python-mimeparse-1.6.0 pytz-2018.3 simplejson-3.13.2 six-1.11.0 speaklater-1.3 sqlparse-0.2.4 sshtunnel-0.1.4 testtools-2.3.0 traceback2-1.4.0 unittest2-1.1.0 webencodings-0.5.1
Ignoring psycopg2: markers 'python_version < "2.7"' don't match your environment
Ignoring Flask-Script: markers 'python_version < "2.7"' don't match your environment
Ignoring ordereddict: markers 'python_version < "2.7"' don't match your environment
Ignoring python-dateutil: markers 'python_version < "2.7"' don't match your environment
Ignoring SQLAlchemy: markers 'python_version < "2.7"' don't match your environment
Ignoring Flask-Security: markers 'python_version < "2.7"' don't match your environment
Ignoring Flask-BabelEx: markers 'python_version < "2.7"' don't match your environment
Ignoring selenium: markers 'python_version < "2.7"' don't match your environment
<https://jenkins.pgadmin.org/job/pgadmin4-master-python27/ws/pgadmin-venv/lib/python2.7/site-packages/pip/_internal/req/req_file.py>:150: UserWarning: Disabling all use of wheels due to the use of --build-options / --global-options / --install-options.
  cmdoptions.check_install_build_global(options, opts)
Requirement already satisfied: blinker==1.4 in ./pgadmin-venv/lib/python2.7/site-packages (from -r web/regression/../../requirements.txt (line 6)) (1.4)
Requirement already satisfied: extras==1.0.0 in ./pgadmin-venv/lib/python2.7/site-packages (from -r web/regression/../../requirements.txt (line 7)) (1.0.0)
Requirement already satisfied: fixtures==3.0.0 in ./pgadmin-venv/lib/python2.7/site-packages (from -r web/regression/../../requirements.txt (line 8)) (3.0.0)
Requirement already satisfied: Flask==0.12.4 in ./pgadmin-venv/lib/python2.7/site-packages (from -r web/regression/../../requirements.txt (line 9)) (0.12.4)
Requirement already satisfied: Flask-Gravatar==0.5.0 in ./pgadmin-venv/lib/python2.7/site-packages (from -r web/regression/../../requirements.txt (line 10)) (0.5.0)
Requirement already satisfied: Flask-Login==0.3.2 in ./pgadmin-venv/lib/python2.7/site-packages (from -r web/regression/../../requirements.txt (line 11)) (0.3.2)
Requirement already satisfied: Flask-Mail==0.9.1 in ./pgadmin-venv/lib/python2.7/site-packages (from -r web/regression/../../requirements.txt (line 12)) (0.9.1)
Requirement already satisfied: Flask-Migrate==2.1.1 in ./pgadmin-venv/lib/python2.7/site-packages (from -r web/regression/../../requirements.txt (line 13)) (2.1.1)
Requirement already satisfied: Flask-Principal==0.4.0 in ./pgadmin-venv/lib/python2.7/site-packages (from -r web/regression/../../requirements.txt (line 14)) (0.4.0)
Requirement already satisfied: Flask-SQLAlchemy==2.3.2 in ./pgadmin-venv/lib/python2.7/site-packages (from -r web/regression/../../requirements.txt (line 15)) (2.3.2)
Requirement already satisfied: Flask-WTF==0.14.2 in ./pgadmin-venv/lib/python2.7/site-packages (from -r web/regression/../../requirements.txt (line 16)) (0.14.2)
Requirement already satisfied: html5lib==1.0.1 in ./pgadmin-venv/lib/python2.7/site-packages (from -r web/regression/../../requirements.txt (line 17)) (1.0.1)
Requirement already satisfied: linecache2==1.0.0 in ./pgadmin-venv/lib/python2.7/site-packages (from -r web/regression/../../requirements.txt (line 18)) (1.0.0)
Requirement already satisfied: passlib==1.7.1 in ./pgadmin-venv/lib/python2.7/site-packages (from -r web/regression/../../requirements.txt (line 19)) (1.7.1)
Requirement already satisfied: pbr==3.1.1 in ./pgadmin-venv/lib/python2.7/site-packages (from -r web/regression/../../requirements.txt (line 20)) (3.1.1)
Requirement already satisfied: pycrypto>=2.6.1 in ./pgadmin-venv/lib/python2.7/site-packages (from -r web/regression/../../requirements.txt (line 21)) (2.6.1)
Requirement already satisfied: pyrsistent==0.14.2 in ./pgadmin-venv/lib/python2.7/site-packages (from -r web/regression/../../requirements.txt (line 22)) (0.14.2)
Requirement already satisfied: python-mimeparse==1.6.0 in ./pgadmin-venv/lib/python2.7/site-packages (from -r web/regression/../../requirements.txt (line 23)) (1.6.0)
Requirement already satisfied: pytz==2018.3 in ./pgadmin-venv/lib/python2.7/site-packages (from -r web/regression/../../requirements.txt (line 24)) (2018.3)
Requirement already satisfied: simplejson==3.13.2 in ./pgadmin-venv/lib/python2.7/site-packages (from -r web/regression/../../requirements.txt (line 25)) (3.13.2)
Requirement already satisfied: six>=1.11.0 in ./pgadmin-venv/lib/python2.7/site-packages (from -r web/regression/../../requirements.txt (line 26)) (1.11.0)
Requirement already satisfied: speaklater==1.3 in ./pgadmin-venv/lib/python2.7/site-packages (from -r web/regression/../../requirements.txt (line 27)) (1.3)
Requirement already satisfied: sqlparse==0.2.4 in ./pgadmin-venv/lib/python2.7/site-packages (from -r web/regression/../../requirements.txt (line 28)) (0.2.4)
Requirement already satisfied: WTForms==2.1 in ./pgadmin-venv/lib/python2.7/site-packages (from -r web/regression/../../requirements.txt (line 29)) (2.1)
Requirement already satisfied: Flask-Paranoid==0.2.0 in ./pgadmin-venv/lib/python2.7/site-packages (from -r web/regression/../../requirements.txt (line 30)) (0.2.0)
Requirement already satisfied: psutil==5.4.7 in ./pgadmin-venv/lib/python2.7/site-packages (from -r web/regression/../../requirements.txt (line 31)) (5.4.7)
Requirement already satisfied: psycopg2>=2.7.4 in ./pgadmin-venv/lib/python2.7/site-packages (from -r web/regression/../../requirements.txt (line 36)) (2.7.6.1)
Requirement already satisfied: python-dateutil>=2.7.1 in ./pgadmin-venv/lib/python2.7/site-packages (from -r web/regression/../../requirements.txt (line 37)) (2.7.5)
Requirement already satisfied: htmlmin==0.1.12 in ./pgadmin-venv/lib/python2.7/site-packages (from -r web/regression/../../requirements.txt (line 38)) (0.1.12)
Requirement already satisfied: Flask-HTMLmin==1.3.2 in ./pgadmin-venv/lib/python2.7/site-packages (from -r web/regression/../../requirements.txt (line 39)) (1.3.2)
Requirement already satisfied: SQLAlchemy>=1.2.5 in ./pgadmin-venv/lib/python2.7/site-packages (from -r web/regression/../../requirements.txt (line 40)) (1.2.14)
Requirement already satisfied: Flask-Security>=3.0.0 in ./pgadmin-venv/lib/python2.7/site-packages (from -r web/regression/../../requirements.txt (line 41)) (3.0.0)
Requirement already satisfied: sshtunnel>=0.1.3 in ./pgadmin-venv/lib/python2.7/site-packages (from -r web/regression/../../requirements.txt (line 42)) (0.1.4)
Requirement already satisfied: backports.csv==1.0.5 in ./pgadmin-venv/lib/python2.7/site-packages (from -r web/regression/../../requirements.txt (line 47)) (1.0.5)
Requirement already satisfied: importlib==1.0.3 in ./pgadmin-venv/lib/python2.7/site-packages (from -r web/regression/../../requirements.txt (line 48)) (1.0.3)
Collecting pycodestyle==2.3.1 (from -r web/regression/requirements.txt (line 9))
  Using cached https://files.pythonhosted.org/packages/e1/88/0e2cbf412bd849ea6f1af1f97882add46a374f4ba1d2aea39353609150ad/pycodestyle-2.3.1.tar.gz
Collecting pyperclip~=1.6.0 (from -r web/regression/requirements.txt (line 10))
  Using cached https://files.pythonhosted.org/packages/80/a4/7c65c8fb16787d74f720dfb1dee4227a65058f268e91014e24fd76b18f8b/pyperclip-1.6.5.tar.gz
Collecting testscenarios==0.5.0 (from -r web/regression/requirements.txt (line 11))
  Using cached https://files.pythonhosted.org/packages/f0/de/b0b5b98c0f38fd7086d082c47fcb455eedd39a044abe7c595f5f40cd6eed/testscenarios-0.5.0.tar.gz
Requirement already satisfied: testtools==2.3.0 in ./pgadmin-venv/lib/python2.7/site-packages (from -r web/regression/requirements.txt (line 12)) (2.3.0)
Requirement already satisfied: traceback2==1.4.0 in ./pgadmin-venv/lib/python2.7/site-packages (from -r web/regression/requirements.txt (line 13)) (1.4.0)
Requirement already satisfied: unittest2==1.1.0 in ./pgadmin-venv/lib/python2.7/site-packages (from -r web/regression/requirements.txt (line 14)) (1.1.0)
Collecting selenium==3.11.0 (from -r web/regression/requirements.txt (line 19))
  Using cached https://files.pythonhosted.org/packages/d4/28/8124d32415bd3d67fabea52480395427576b582771283e89ce10a56d9e5b/selenium-3.11.0.tar.gz
Collecting mock===2.0.0 (from -r web/regression/requirements.txt (line 29))
  Using cached https://files.pythonhosted.org/packages/0c/53/014354fc93c591ccc4abff12c473ad565a2eb24dcd82490fae33dbf2539f/mock-2.0.0.tar.gz
Collecting chromedriver_installer==0.0.6 (from -r web/regression/requirements.txt (line 33))
  Using cached https://files.pythonhosted.org/packages/c8/01/0a8a725bb605f68923aba16099a01cbbfe547c8b7dc96fd9a554424f6524/chromedriver_installer-0.0.6.tar.gz
Requirement already satisfied: itsdangerous>=0.21 in ./pgadmin-venv/lib/python2.7/site-packages (from Flask==0.12.4->-r web/regression/../../requirements.txt (line 9)) (1.1.0)
Requirement already satisfied: click>=2.0 in ./pgadmin-venv/lib/python2.7/site-packages (from Flask==0.12.4->-r web/regression/../../requirements.txt (line 9)) (7.0)
Requirement already satisfied: Werkzeug>=0.7 in ./pgadmin-venv/lib/python2.7/site-packages (from Flask==0.12.4->-r web/regression/../../requirements.txt (line 9)) (0.14.1)
Requirement already satisfied: Jinja2>=2.4 in ./pgadmin-venv/lib/python2.7/site-packages (from Flask==0.12.4->-r web/regression/../../requirements.txt (line 9)) (2.10)
Requirement already satisfied: alembic>=0.6 in ./pgadmin-venv/lib/python2.7/site-packages (from Flask-Migrate==2.1.1->-r web/regression/../../requirements.txt (line 13)) (1.0.5)
Requirement already satisfied: webencodings in ./pgadmin-venv/lib/python2.7/site-packages (from html5lib==1.0.1->-r web/regression/../../requirements.txt (line 17)) (0.5.1)
Requirement already satisfied: Flask-BabelEx>=0.9.3 in ./pgadmin-venv/lib/python2.7/site-packages (from Flask-Security>=3.0.0->-r web/regression/../../requirements.txt (line 41)) (0.9.3)
Requirement already satisfied: paramiko>=1.15.2 in ./pgadmin-venv/lib/python2.7/site-packages (from sshtunnel>=0.1.3->-r web/regression/../../requirements.txt (line 42)) (2.4.2)
Requirement already satisfied: argparse in ./pgadmin-venv/lib/python2.7/site-packages (from unittest2==1.1.0->-r web/regression/requirements.txt (line 14)) (1.4.0)
Collecting funcsigs>=1 (from mock===2.0.0->-r web/regression/requirements.txt (line 29))
  Using cached https://files.pythonhosted.org/packages/94/4a/db842e7a0545de1cdb0439bb80e6e42dfe82aaeaadd4072f2263a4fbed23/funcsigs-1.0.2.tar.gz
Requirement already satisfied: MarkupSafe>=0.23 in ./pgadmin-venv/lib/python2.7/site-packages (from Jinja2>=2.4->Flask==0.12.4->-r web/regression/../../requirements.txt (line 9)) (1.1.0)
Requirement already satisfied: python-editor>=0.3 in ./pgadmin-venv/lib/python2.7/site-packages (from alembic>=0.6->Flask-Migrate==2.1.1->-r web/regression/../../requirements.txt (line 13)) (1.0.3)
Requirement already satisfied: Mako in ./pgadmin-venv/lib/python2.7/site-packages (from alembic>=0.6->Flask-Migrate==2.1.1->-r web/regression/../../requirements.txt (line 13)) (1.0.7)
Requirement already satisfied: Babel>=1.0 in ./pgadmin-venv/lib/python2.7/site-packages (from Flask-BabelEx>=0.9.3->Flask-Security>=3.0.0->-r web/regression/../../requirements.txt (line 41)) (2.6.0)
Requirement already satisfied: pynacl>=1.0.1 in ./pgadmin-venv/lib/python2.7/site-packages (from paramiko>=1.15.2->sshtunnel>=0.1.3->-r web/regression/../../requirements.txt (line 42)) (1.3.0)
Requirement already satisfied: cryptography>=1.5 in ./pgadmin-venv/lib/python2.7/site-packages (from paramiko>=1.15.2->sshtunnel>=0.1.3->-r web/regression/../../requirements.txt (line 42)) (2.4.2)
Requirement already satisfied: bcrypt>=3.1.3 in ./pgadmin-venv/lib/python2.7/site-packages (from paramiko>=1.15.2->sshtunnel>=0.1.3->-r web/regression/../../requirements.txt (line 42)) (3.1.4)
Requirement already satisfied: pyasn1>=0.1.7 in ./pgadmin-venv/lib/python2.7/site-packages (from paramiko>=1.15.2->sshtunnel>=0.1.3->-r web/regression/../../requirements.txt (line 42)) (0.4.4)
Requirement already satisfied: cffi>=1.4.1 in ./pgadmin-venv/lib/python2.7/site-packages (from pynacl>=1.0.1->paramiko>=1.15.2->sshtunnel>=0.1.3->-r web/regression/../../requirements.txt (line 42)) (1.11.5)
Requirement already satisfied: idna>=2.1 in ./pgadmin-venv/lib/python2.7/site-packages (from cryptography>=1.5->paramiko>=1.15.2->sshtunnel>=0.1.3->-r web/regression/../../requirements.txt (line 42)) (2.7)
Requirement already satisfied: enum34; python_version < "3" in ./pgadmin-venv/lib/python2.7/site-packages (from cryptography>=1.5->paramiko>=1.15.2->sshtunnel>=0.1.3->-r web/regression/../../requirements.txt (line 42)) (1.1.6)
Requirement already satisfied: asn1crypto>=0.21.0 in ./pgadmin-venv/lib/python2.7/site-packages (from cryptography>=1.5->paramiko>=1.15.2->sshtunnel>=0.1.3->-r web/regression/../../requirements.txt (line 42)) (0.24.0)
Requirement already satisfied: ipaddress; python_version < "3" in ./pgadmin-venv/lib/python2.7/site-packages (from cryptography>=1.5->paramiko>=1.15.2->sshtunnel>=0.1.3->-r web/regression/../../requirements.txt (line 42)) (1.0.22)
Requirement already satisfied: pycparser in ./pgadmin-venv/lib/python2.7/site-packages (from cffi>=1.4.1->pynacl>=1.0.1->paramiko>=1.15.2->sshtunnel>=0.1.3->-r web/regression/../../requirements.txt (line 42)) (2.19)
Skipping bdist_wheel for pycodestyle, due to binaries being disabled for it.
Skipping bdist_wheel for pyperclip, due to binaries being disabled for it.
Skipping bdist_wheel for testscenarios, due to binaries being disabled for it.
Skipping bdist_wheel for selenium, due to binaries being disabled for it.
Skipping bdist_wheel for mock, due to binaries being disabled for it.
Skipping bdist_wheel for chromedriver-installer, due to binaries being disabled for it.
Skipping bdist_wheel for funcsigs, due to binaries being disabled for it.
Installing collected packages: pycodestyle, pyperclip, testscenarios, selenium, funcsigs, mock, chromedriver-installer
  Running setup.py install for pycodestyle: started
    Running setup.py install for pycodestyle: finished with status 'done'
  Running setup.py install for pyperclip: started
    Running setup.py install for pyperclip: finished with status 'done'
  Running setup.py install for testscenarios: started
    Running setup.py install for testscenarios: finished with status 'done'
  Running setup.py install for selenium: started
    Running setup.py install for selenium: finished with status 'done'
  Running setup.py install for funcsigs: started
    Running setup.py install for funcsigs: finished with status 'done'
  Running setup.py install for mock: started
    Running setup.py install for mock: finished with status 'done'
  Running setup.py install for chromedriver-installer: started
    Running setup.py install for chromedriver-installer: finished with status 'done'
Successfully installed chromedriver-installer-0.0.6 funcsigs-1.0.2 mock-2.0.0 pycodestyle-2.3.1 pyperclip-1.6.5 selenium-3.11.0 testscenarios-0.5.0
Running PEP-8 checks...

cd web && pycodestyle --config=.pycodestyle .
./pgadmin/utils/driver/psycopg2/connection.py:405: [E501] line too long (81 > 79 characters)
1
1       E501 line too long (81 > 79 characters)
make: *** [check-pep8] Error 1
ERROR: Error detected when running the Python PEP-8 checks.
ERROR: Error detected when running the Python tests.
Build step 'Execute shell' marked build as failure

Reply | Threaded
Open this post in threaded view
|

Build failed in Jenkins: pgadmin4-master-python27 #823

pgAdmin 4 Jenkins
See <https://jenkins.pgadmin.org/job/pgadmin4-master-python27/823/display/redirect?page=changes>

Changes:

[Dave Page] Fix PEP8 issue.

------------------------------------------
[...truncated 22.15 KB...]
Requirement already satisfied: testtools==2.3.0 in ./pgadmin-venv/lib/python2.7/site-packages (from -r web/regression/requirements.txt (line 12)) (2.3.0)
Requirement already satisfied: traceback2==1.4.0 in ./pgadmin-venv/lib/python2.7/site-packages (from -r web/regression/requirements.txt (line 13)) (1.4.0)
Requirement already satisfied: unittest2==1.1.0 in ./pgadmin-venv/lib/python2.7/site-packages (from -r web/regression/requirements.txt (line 14)) (1.1.0)
Collecting selenium==3.11.0 (from -r web/regression/requirements.txt (line 19))
  Using cached https://files.pythonhosted.org/packages/d4/28/8124d32415bd3d67fabea52480395427576b582771283e89ce10a56d9e5b/selenium-3.11.0.tar.gz
Collecting mock===2.0.0 (from -r web/regression/requirements.txt (line 29))
  Using cached https://files.pythonhosted.org/packages/0c/53/014354fc93c591ccc4abff12c473ad565a2eb24dcd82490fae33dbf2539f/mock-2.0.0.tar.gz
Collecting chromedriver_installer==0.0.6 (from -r web/regression/requirements.txt (line 33))
  Using cached https://files.pythonhosted.org/packages/c8/01/0a8a725bb605f68923aba16099a01cbbfe547c8b7dc96fd9a554424f6524/chromedriver_installer-0.0.6.tar.gz
Requirement already satisfied: itsdangerous>=0.21 in ./pgadmin-venv/lib/python2.7/site-packages (from Flask==0.12.4->-r web/regression/../../requirements.txt (line 9)) (1.1.0)
Requirement already satisfied: click>=2.0 in ./pgadmin-venv/lib/python2.7/site-packages (from Flask==0.12.4->-r web/regression/../../requirements.txt (line 9)) (7.0)
Requirement already satisfied: Werkzeug>=0.7 in ./pgadmin-venv/lib/python2.7/site-packages (from Flask==0.12.4->-r web/regression/../../requirements.txt (line 9)) (0.14.1)
Requirement already satisfied: Jinja2>=2.4 in ./pgadmin-venv/lib/python2.7/site-packages (from Flask==0.12.4->-r web/regression/../../requirements.txt (line 9)) (2.10)
Requirement already satisfied: alembic>=0.6 in ./pgadmin-venv/lib/python2.7/site-packages (from Flask-Migrate==2.1.1->-r web/regression/../../requirements.txt (line 13)) (1.0.5)
Requirement already satisfied: webencodings in ./pgadmin-venv/lib/python2.7/site-packages (from html5lib==1.0.1->-r web/regression/../../requirements.txt (line 17)) (0.5.1)
Requirement already satisfied: Flask-BabelEx>=0.9.3 in ./pgadmin-venv/lib/python2.7/site-packages (from Flask-Security>=3.0.0->-r web/regression/../../requirements.txt (line 41)) (0.9.3)
Requirement already satisfied: paramiko>=1.15.2 in ./pgadmin-venv/lib/python2.7/site-packages (from sshtunnel>=0.1.3->-r web/regression/../../requirements.txt (line 42)) (2.4.2)
Requirement already satisfied: argparse in ./pgadmin-venv/lib/python2.7/site-packages (from unittest2==1.1.0->-r web/regression/requirements.txt (line 14)) (1.4.0)
Collecting funcsigs>=1 (from mock===2.0.0->-r web/regression/requirements.txt (line 29))
  Using cached https://files.pythonhosted.org/packages/94/4a/db842e7a0545de1cdb0439bb80e6e42dfe82aaeaadd4072f2263a4fbed23/funcsigs-1.0.2.tar.gz
Requirement already satisfied: MarkupSafe>=0.23 in ./pgadmin-venv/lib/python2.7/site-packages (from Jinja2>=2.4->Flask==0.12.4->-r web/regression/../../requirements.txt (line 9)) (1.1.0)
Requirement already satisfied: python-editor>=0.3 in ./pgadmin-venv/lib/python2.7/site-packages (from alembic>=0.6->Flask-Migrate==2.1.1->-r web/regression/../../requirements.txt (line 13)) (1.0.3)
Requirement already satisfied: Mako in ./pgadmin-venv/lib/python2.7/site-packages (from alembic>=0.6->Flask-Migrate==2.1.1->-r web/regression/../../requirements.txt (line 13)) (1.0.7)
Requirement already satisfied: Babel>=1.0 in ./pgadmin-venv/lib/python2.7/site-packages (from Flask-BabelEx>=0.9.3->Flask-Security>=3.0.0->-r web/regression/../../requirements.txt (line 41)) (2.6.0)
Requirement already satisfied: pynacl>=1.0.1 in ./pgadmin-venv/lib/python2.7/site-packages (from paramiko>=1.15.2->sshtunnel>=0.1.3->-r web/regression/../../requirements.txt (line 42)) (1.3.0)
Requirement already satisfied: cryptography>=1.5 in ./pgadmin-venv/lib/python2.7/site-packages (from paramiko>=1.15.2->sshtunnel>=0.1.3->-r web/regression/../../requirements.txt (line 42)) (2.4.2)
Requirement already satisfied: bcrypt>=3.1.3 in ./pgadmin-venv/lib/python2.7/site-packages (from paramiko>=1.15.2->sshtunnel>=0.1.3->-r web/regression/../../requirements.txt (line 42)) (3.1.4)
Requirement already satisfied: pyasn1>=0.1.7 in ./pgadmin-venv/lib/python2.7/site-packages (from paramiko>=1.15.2->sshtunnel>=0.1.3->-r web/regression/../../requirements.txt (line 42)) (0.4.4)
Requirement already satisfied: cffi>=1.4.1 in ./pgadmin-venv/lib/python2.7/site-packages (from pynacl>=1.0.1->paramiko>=1.15.2->sshtunnel>=0.1.3->-r web/regression/../../requirements.txt (line 42)) (1.11.5)
Requirement already satisfied: idna>=2.1 in ./pgadmin-venv/lib/python2.7/site-packages (from cryptography>=1.5->paramiko>=1.15.2->sshtunnel>=0.1.3->-r web/regression/../../requirements.txt (line 42)) (2.8)
Requirement already satisfied: enum34; python_version < "3" in ./pgadmin-venv/lib/python2.7/site-packages (from cryptography>=1.5->paramiko>=1.15.2->sshtunnel>=0.1.3->-r web/regression/../../requirements.txt (line 42)) (1.1.6)
Requirement already satisfied: asn1crypto>=0.21.0 in ./pgadmin-venv/lib/python2.7/site-packages (from cryptography>=1.5->paramiko>=1.15.2->sshtunnel>=0.1.3->-r web/regression/../../requirements.txt (line 42)) (0.24.0)
Requirement already satisfied: ipaddress; python_version < "3" in ./pgadmin-venv/lib/python2.7/site-packages (from cryptography>=1.5->paramiko>=1.15.2->sshtunnel>=0.1.3->-r web/regression/../../requirements.txt (line 42)) (1.0.22)
Requirement already satisfied: pycparser in ./pgadmin-venv/lib/python2.7/site-packages (from cffi>=1.4.1->pynacl>=1.0.1->paramiko>=1.15.2->sshtunnel>=0.1.3->-r web/regression/../../requirements.txt (line 42)) (2.19)
Skipping bdist_wheel for pycodestyle, due to binaries being disabled for it.
Skipping bdist_wheel for pyperclip, due to binaries being disabled for it.
Skipping bdist_wheel for testscenarios, due to binaries being disabled for it.
Skipping bdist_wheel for selenium, due to binaries being disabled for it.
Skipping bdist_wheel for mock, due to binaries being disabled for it.
Skipping bdist_wheel for chromedriver-installer, due to binaries being disabled for it.
Skipping bdist_wheel for funcsigs, due to binaries being disabled for it.
Installing collected packages: pycodestyle, pyperclip, testscenarios, selenium, funcsigs, mock, chromedriver-installer
  Running setup.py install for pycodestyle: started
    Running setup.py install for pycodestyle: finished with status 'done'
  Running setup.py install for pyperclip: started
    Running setup.py install for pyperclip: finished with status 'done'
  Running setup.py install for testscenarios: started
    Running setup.py install for testscenarios: finished with status 'done'
  Running setup.py install for selenium: started
    Running setup.py install for selenium: finished with status 'done'
  Running setup.py install for funcsigs: started
    Running setup.py install for funcsigs: finished with status 'done'
  Running setup.py install for mock: started
    Running setup.py install for mock: finished with status 'done'
  Running setup.py install for chromedriver-installer: started
    Running setup.py install for chromedriver-installer: finished with status 'done'
Successfully installed chromedriver-installer-0.0.6 funcsigs-1.0.2 mock-2.0.0 pycodestyle-2.3.1 pyperclip-1.6.5 selenium-3.11.0 testscenarios-0.5.0
Running PEP-8 checks...

cd web && pycodestyle --config=.pycodestyle .
Running regression tests...

<https://jenkins.pgadmin.org/job/pgadmin4-master-python27/ws/pgadmin-venv/lib/python2.7/site-packages/psycopg2/__init__.py>:144: UserWarning: The psycopg2 wheel package will be renamed from release 2.8; in order to keep installing from binary please use "pip install psycopg2-binary" instead. For details see: <http://initd.org/psycopg/docs/install.html#binary-install-from-pypi>.
  """)
2018-12-04 17:34:58,911: INFO pgadmin: ########################################################
2018-12-04 17:34:58,911: INFO pgadmin: Starting pgAdmin 4 v3.6...
2018-12-04 17:34:58,912: INFO pgadmin: ########################################################
2018-12-04 17:34:58,912: DEBUG pgadmin: Python syspath: ['<https://jenkins.pgadmin.org/job/pgadmin4-master-python27/ws/web/regression',> '<https://jenkins.pgadmin.org/job/pgadmin4-master-python27/ws/web',> '<https://jenkins.pgadmin.org/job/pgadmin4-master-python27/ws/web/regression',> '<https://jenkins.pgadmin.org/job/pgadmin4-master-python27/ws/pgadmin-venv/lib/python27.zip',> '<https://jenkins.pgadmin.org/job/pgadmin4-master-python27/ws/pgadmin-venv/lib/python2.7',> '<https://jenkins.pgadmin.org/job/pgadmin4-master-python27/ws/pgadmin-venv/lib/python2.7/plat-linux2',> '<https://jenkins.pgadmin.org/job/pgadmin4-master-python27/ws/pgadmin-venv/lib/python2.7/lib-tk',> '<https://jenkins.pgadmin.org/job/pgadmin4-master-python27/ws/pgadmin-venv/lib/python2.7/lib-old',> '<https://jenkins.pgadmin.org/job/pgadmin4-master-python27/ws/pgadmin-venv/lib/python2.7/lib-dynload',> '/usr/local/python-2.7/lib/python2.7', '/usr/local/python-2.7/lib/python2.7/plat-linux2', '/usr/local/python-2.7/lib/python2.7/lib-tk', '<https://jenkins.pgadmin.org/job/pgadmin4-master-python27/ws/pgadmin-venv/lib/python2.7/site-packages']>
2018-12-04 17:34:58,912: DEBUG pgadmin: Available translations: [Locale('pl'), Locale('zh'), Locale('de'), Locale('ja'), Locale('ru'), Locale('fr'), Locale('ko'), Locale('es')]
2018-12-04 17:34:59,450: INFO pgadmin: Examining potential module: pgadmin.about
2018-12-04 17:34:59,451: INFO pgadmin: Registering blueprint module: <pgadmin.about.AboutModule object at 0x7ff6e2dee210>
2018-12-04 17:34:59,452: INFO pgadmin: Examining potential module: pgadmin.browser
2018-12-04 17:34:59,452: INFO pgadmin: Registering blueprint module: <pgadmin.browser.BrowserModule object at 0x7ff6e734aed0>
2018-12-04 17:34:59,452: INFO pgadmin: Examining potential module: pgadmin.browser.collection
2018-12-04 17:34:59,453: INFO pgadmin: Examining potential module: pgadmin.browser.register_browser_preferences
2018-12-04 17:34:59,453: INFO pgadmin: Examining potential module: pgadmin.browser.server_groups
2018-12-04 17:34:59,453: INFO pgadmin: Examining potential module: pgadmin.browser.tests
2018-12-04 17:34:59,454: INFO pgadmin: Examining potential module: pgadmin.browser.utils
2018-12-04 17:34:59,456: INFO pgadmin: Examining potential module: pgadmin.browser.server_groups.servers
2018-12-04 17:34:59,456: INFO pgadmin: Examining potential module: pgadmin.browser.server_groups.tests
2018-12-04 17:34:59,459: INFO pgadmin: Examining potential module: pgadmin.browser.server_groups.servers.databases
2018-12-04 17:34:59,460: INFO pgadmin: Examining potential module: pgadmin.browser.server_groups.servers.gpdb
2018-12-04 17:34:59,460: INFO pgadmin: Examining potential module: pgadmin.browser.server_groups.servers.pgagent
2018-12-04 17:34:59,464: INFO pgadmin: Examining potential module: pgadmin.browser.server_groups.servers.ppas
2018-12-04 17:34:59,464: INFO pgadmin: Examining potential module: pgadmin.browser.server_groups.servers.resource_groups
2018-12-04 17:34:59,468: INFO pgadmin: Examining potential module: pgadmin.browser.server_groups.servers.roles
2018-12-04 17:34:59,468: INFO pgadmin: Examining potential module: pgadmin.browser.server_groups.servers.tablespaces
2018-12-04 17:34:59,469: INFO pgadmin: Examining potential module: pgadmin.browser.server_groups.servers.tests
2018-12-04 17:34:59,469: INFO pgadmin: Examining potential module: pgadmin.browser.server_groups.servers.types
2018-12-04 17:34:59,469: INFO pgadmin: Examining potential module: pgadmin.browser.server_groups.servers.utils
2018-12-04 17:34:59,475: INFO pgadmin: Examining potential module: pgadmin.browser.server_groups.servers.databases.casts
2018-12-04 17:34:59,479: INFO pgadmin: Examining potential module: pgadmin.browser.server_groups.servers.databases.event_triggers
2018-12-04 17:34:59,483: INFO pgadmin: Examining potential module: pgadmin.browser.server_groups.servers.databases.extensions
2018-12-04 17:34:59,486: INFO pgadmin: Examining potential module: pgadmin.browser.server_groups.servers.databases.external_tables
2018-12-04 17:34:59,490: INFO pgadmin: Examining potential module: pgadmin.browser.server_groups.servers.databases.foreign_data_wrappers
2018-12-04 17:34:59,494: INFO pgadmin: Examining potential module: pgadmin.browser.server_groups.servers.databases.languages
2018-12-04 17:34:59,498: INFO pgadmin: Examining potential module: pgadmin.browser.server_groups.servers.databases.schemas
2018-12-04 17:34:59,499: INFO pgadmin: Examining potential module: pgadmin.browser.server_groups.servers.databases.tests
2018-12-04 17:34:59,499: INFO pgadmin: Examining potential module: pgadmin.browser.server_groups.servers.databases.utils
2018-12-04 17:34:59,507: INFO pgadmin: Examining potential module: pgadmin.browser.server_groups.servers.databases.casts.tests
2018-12-04 17:34:59,515: INFO pgadmin: Examining potential module: pgadmin.browser.server_groups.servers.databases.event_triggers.tests
2018-12-04 17:34:59,522: INFO pgadmin: Examining potential module: pgadmin.browser.server_groups.servers.databases.extensions.tests
2018-12-04 17:34:59,529: INFO pgadmin: Examining potential module: pgadmin.browser.server_groups.servers.databases.external_tables.actions
2018-12-04 17:34:59,529: INFO pgadmin: Examining potential module: pgadmin.browser.server_groups.servers.databases.external_tables.mapping_utils
2018-12-04 17:34:59,530: INFO pgadmin: Examining potential module: pgadmin.browser.server_groups.servers.databases.external_tables.properties
2018-12-04 17:34:59,530: INFO pgadmin: Examining potential module: pgadmin.browser.server_groups.servers.databases.external_tables.reverse_engineer_ddl
2018-12-04 17:34:59,530: INFO pgadmin: Examining potential module: pgadmin.browser.server_groups.servers.databases.external_tables.tests
2018-12-04 17:34:59,533: INFO pgadmin: Examining potential module: pgadmin.browser.server_groups.servers.databases.foreign_data_wrappers.foreign_servers
2018-12-04 17:34:59,538: INFO pgadmin: Examining potential module: pgadmin.browser.server_groups.servers.databases.foreign_data_wrappers.tests
2018-12-04 17:34:59,545: INFO pgadmin: Examining potential module: pgadmin.browser.server_groups.servers.databases.foreign_data_wrappers.foreign_servers.tests
2018-12-04 17:34:59,546: INFO pgadmin: Examining potential module: pgadmin.browser.server_groups.servers.databases.foreign_data_wrappers.foreign_servers.user_mapping
2018-12-04 17:34:59,557: INFO pgadmin: Examining potential module: pgadmin.browser.server_groups.servers.databases.foreign_data_wrappers.foreign_servers.user_mapping.tests
2018-12-04 17:34:59,565: INFO pgadmin: Examining potential module: pgadmin.browser.server_groups.servers.databases.languages.tests
2018-12-04 17:34:59,572: INFO pgadmin: Examining potential module: pgadmin.browser.server_groups.servers.databases.schemas.catalog_objects
2018-12-04 17:34:59,574: INFO pgadmin: Examining potential module: pgadmin.browser.server_groups.servers.databases.schemas.collations
2018-12-04 17:34:59,577: INFO pgadmin: Examining potential module: pgadmin.browser.server_groups.servers.databases.schemas.domains
2018-12-04 17:34:59,582: INFO pgadmin: Examining potential module: pgadmin.browser.server_groups.servers.databases.schemas.foreign_tables
2018-12-04 17:34:59,592: INFO pgadmin: Examining potential module: pgadmin.browser.server_groups.servers.databases.schemas.fts_configurations
2018-12-04 17:34:59,598: INFO pgadmin: Examining potential module: pgadmin.browser.server_groups.servers.databases.schemas.fts_dictionaries
2018-12-04 17:34:59,602: INFO pgadmin: Examining potential module: pgadmin.browser.server_groups.servers.databases.schemas.fts_parser
2018-12-04 17:34:59,607: INFO pgadmin: Examining potential module: pgadmin.browser.server_groups.servers.databases.schemas.fts_templates
2018-12-04 17:34:59,611: INFO pgadmin: Examining potential module: pgadmin.browser.server_groups.servers.databases.schemas.functions
2018-12-04 17:34:59,611: INFO pgadmin: Examining potential module: pgadmin.browser.server_groups.servers.databases.schemas.packages
2018-12-04 17:34:59,615: INFO pgadmin: Examining potential module: pgadmin.browser.server_groups.servers.databases.schemas.sequences
2018-12-04 17:34:59,620: INFO pgadmin: Examining potential module: pgadmin.browser.server_groups.servers.databases.schemas.synonyms
2018-12-04 17:34:59,623: INFO pgadmin: Examining potential module: pgadmin.browser.server_groups.servers.databases.schemas.tables
2018-12-04 17:34:59,648: INFO pgadmin: Examining potential module: pgadmin.browser.server_groups.servers.databases.schemas.tests
2018-12-04 17:34:59,648: INFO pgadmin: Examining potential module: pgadmin.browser.server_groups.servers.databases.schemas.types
2018-12-04 17:34:59,659: INFO pgadmin: Examining potential module: pgadmin.browser.server_groups.servers.databases.schemas.utils
2018-12-04 17:34:59,660: INFO pgadmin: Examining potential module: pgadmin.browser.server_groups.servers.databases.schemas.views
2018-12-04 17:34:59,676: INFO pgadmin: Examining potential module: pgadmin.browser.server_groups.servers.databases.schemas.catalog_objects.columns
2018-12-04 17:34:59,688: INFO pgadmin: Examining potential module: pgadmin.browser.server_groups.servers.databases.schemas.collations.tests
2018-12-04 17:34:59,696: INFO pgadmin: Examining potential module: pgadmin.browser.server_groups.servers.databases.schemas.domains.domain_constraints
2018-12-04 17:34:59,699: INFO pgadmin: Examining potential module: pgadmin.browser.server_groups.servers.databases.schemas.domains.tests
2018-12-04 17:34:59,715: INFO pgadmin: Examining potential module: pgadmin.browser.server_groups.servers.databases.schemas.foreign_tables.tests
2018-12-04 17:34:59,730: INFO pgadmin: Examining potential module: pgadmin.browser.server_groups.servers.databases.schemas.fts_configurations.tests
2018-12-04 17:34:59,741: INFO pgadmin: Examining potential module: pgadmin.browser.server_groups.servers.databases.schemas.fts_dictionaries.tests
2018-12-04 17:34:59,749: INFO pgadmin: Examining potential module: pgadmin.browser.server_groups.servers.databases.schemas.fts_parser.tests
2018-12-04 17:34:59,762: INFO pgadmin: Examining potential module: pgadmin.browser.server_groups.servers.databases.schemas.fts_templates.tests
2018-12-04 17:34:59,771: INFO pgadmin: Examining potential module: pgadmin.browser.server_groups.servers.databases.schemas.functions.tests
2018-12-04 17:34:59,782: INFO pgadmin: Examining potential module: pgadmin.browser.server_groups.servers.databases.schemas.functions.tests
2018-12-04 17:34:59,795: INFO pgadmin: Examining potential module: pgadmin.browser.server_groups.servers.databases.schemas.functions.tests
2018-12-04 17:34:59,811: INFO pgadmin: Examining potential module: pgadmin.browser.server_groups.servers.databases.schemas.packages.edbfuncs
2018-12-04 17:34:59,815: INFO pgadmin: Examining potential module: pgadmin.browser.server_groups.servers.databases.schemas.packages.edbvars
2018-12-04 17:34:59,817: INFO pgadmin: Examining potential module: pgadmin.browser.server_groups.servers.databases.schemas.packages.tests
2018-12-04 17:34:59,825: INFO pgadmin: Examining potential module: pgadmin.browser.server_groups.servers.databases.schemas.packages.edbfuncs.tests
2018-12-04 17:34:59,830: INFO pgadmin: Examining potential module: pgadmin.browser.server_groups.servers.databases.schemas.packages.edbfuncs.tests
2018-12-04 17:34:59,838: INFO pgadmin: Examining potential module: pgadmin.browser.server_groups.servers.databases.schemas.sequences.tests
2018-12-04 17:34:59,878: INFO pgadmin: Examining potential module: pgadmin.browser.server_groups.servers.databases.schemas.synonyms.tests
2018-12-04 17:34:59,886: INFO pgadmin: Examining potential module: pgadmin.browser.server_groups.servers.databases.schemas.tables.base_partition_table
2018-12-04 17:34:59,887: INFO pgadmin: Examining potential module: pgadmin.browser.server_groups.servers.databases.schemas.tables.column
2018-12-04 17:34:59,892: INFO pgadmin: Examining potential module: pgadmin.browser.server_groups.servers.databases.schemas.tables.constraints
2018-12-04 17:34:59,894: INFO pgadmin: Examining potential module: pgadmin.browser.server_groups.servers.databases.schemas.tables.indexes
2018-12-04 17:34:59,903: INFO pgadmin: Examining potential module: pgadmin.browser.server_groups.servers.databases.schemas.tables.partitions
2018-12-04 17:34:59,903: INFO pgadmin: Examining potential module: pgadmin.browser.server_groups.servers.databases.schemas.tables.rules
2018-12-04 17:34:59,906: INFO pgadmin: Examining potential module: pgadmin.browser.server_groups.servers.databases.schemas.tables.tests
2018-12-04 17:34:59,907: INFO pgadmin: Examining potential module: pgadmin.browser.server_groups.servers.databases.schemas.tables.triggers
2018-12-04 17:34:59,912: INFO pgadmin: Examining potential module: pgadmin.browser.server_groups.servers.databases.schemas.tables.utils
2018-12-04 17:34:59,939: INFO pgadmin: Examining potential module: pgadmin.browser.server_groups.servers.databases.schemas.tables.column.tests
2018-12-04 17:34:59,945: INFO pgadmin: Examining potential module: pgadmin.browser.server_groups.servers.databases.schemas.tables.constraints.check_constraint
2018-12-04 17:34:59,951: INFO pgadmin: Examining potential module: pgadmin.browser.server_groups.servers.databases.schemas.tables.constraints.exclusion_constraint
2018-12-04 17:34:59,957: INFO pgadmin: Examining potential module: pgadmin.browser.server_groups.servers.databases.schemas.tables.constraints.foreign_key
2018-12-04 17:34:59,963: INFO pgadmin: Examining potential module: pgadmin.browser.server_groups.servers.databases.schemas.tables.constraints.index_constraint
2018-12-04 17:34:59,971: INFO pgadmin: Examining potential module: pgadmin.browser.server_groups.servers.databases.schemas.tables.constraints.tests
2018-12-04 17:34:59,972: INFO pgadmin: Examining potential module: pgadmin.browser.server_groups.servers.databases.schemas.tables.constraints.type
2018-12-04 17:34:59,974: INFO pgadmin: Examining potential module: pgadmin.browser.server_groups.servers.databases.schemas.tables.constraints.check_constraint.tests
2018-12-04 17:35:00,014: INFO pgadmin: Examining potential module: pgadmin.browser.server_groups.servers.databases.schemas.tables.indexes.tests
2018-12-04 17:35:00,026: INFO pgadmin: Examining potential module: pgadmin.browser.server_groups.servers.databases.schemas.tables.partitions.tests
2018-12-04 17:35:00,026: INFO pgadmin: Examining potential module: pgadmin.browser.server_groups.servers.databases.schemas.tables.partitions.tests
2018-12-04 17:35:00,032: INFO pgadmin: Examining potential module: pgadmin.browser.server_groups.servers.databases.schemas.tables.rules.tests
2018-12-04 17:35:00,040: INFO pgadmin: Examining potential module: pgadmin.browser.server_groups.servers.databases.schemas.tables.triggers.tests
2018-12-04 17:35:00,050: INFO pgadmin: Examining potential module: pgadmin.browser.server_groups.servers.databases.schemas.types.tests
2018-12-04 17:35:00,064: INFO pgadmin: Examining potential module: pgadmin.browser.server_groups.servers.databases.schemas.views.children
2018-12-04 17:35:00,065: INFO pgadmin: Examining potential module: pgadmin.browser.server_groups.servers.databases.schemas.views.tests
2018-12-04 17:35:00,112: INFO pgadmin: Examining potential module: pgadmin.browser.server_groups.servers.databases.schemas.views.children
2018-12-04 17:35:00,112: INFO pgadmin: Examining potential module: pgadmin.browser.server_groups.servers.databases.schemas.views.tests
2018-12-04 17:35:00,159: INFO pgadmin: Examining potential module: pgadmin.browser.server_groups.servers.databases.schemas.catalog_objects
2018-12-04 17:35:00,159: INFO pgadmin: Examining potential module: pgadmin.browser.server_groups.servers.databases.schemas.collations
2018-12-04 17:35:00,159: INFO pgadmin: Examining potential module: pgadmin.browser.server_groups.servers.databases.schemas.domains
2018-12-04 17:35:00,159: INFO pgadmin: Examining potential module: pgadmin.browser.server_groups.servers.databases.schemas.foreign_tables
2018-12-04 17:35:00,159: INFO pgadmin: Examining potential module: pgadmin.browser.server_groups.servers.databases.schemas.fts_configurations
2018-12-04 17:35:00,160: INFO pgadmin: Examining potential module: pgadmin.browser.server_groups.servers.databases.schemas.fts_dictionaries
2018-12-04 17:35:00,160: INFO pgadmin: Examining potential module: pgadmin.browser.server_groups.servers.databases.schemas.fts_parser
2018-12-04 17:35:00,160: INFO pgadmin: Examining potential module: pgadmin.browser.server_groups.servers.databases.schemas.fts_templates
2018-12-04 17:35:00,160: INFO pgadmin: Examining potential module: pgadmin.browser.server_groups.servers.databases.schemas.functions
2018-12-04 17:35:00,160: INFO pgadmin: Examining potential module: pgadmin.browser.server_groups.servers.databases.schemas.packages
2018-12-04 17:35:00,161: INFO pgadmin: Examining potential module: pgadmin.browser.server_groups.servers.databases.schemas.sequences
2018-12-04 17:35:00,161: INFO pgadmin: Examining potential module: pgadmin.browser.server_groups.servers.databases.schemas.synonyms
2018-12-04 17:35:00,161: INFO pgadmin: Examining potential module: pgadmin.browser.server_groups.servers.databases.schemas.tables
2018-12-04 17:35:00,161: INFO pgadmin: Examining potential module: pgadmin.browser.server_groups.servers.databases.schemas.tests
2018-12-04 17:35:00,161: INFO pgadmin: Examining potential module: pgadmin.browser.server_groups.servers.databases.schemas.types
2018-12-04 17:35:00,161: INFO pgadmin: Examining potential module: pgadmin.browser.server_groups.servers.databases.schemas.utils
2018-12-04 17:35:00,162: INFO pgadmin: Examining potential module: pgadmin.browser.server_groups.servers.databases.schemas.views
2018-12-04 17:35:00,657: INFO pgadmin: Examining potential module: pgadmin.browser.server_groups.servers.pgagent.schedules
2018-12-04 17:35:00,661: INFO pgadmin: Examining potential module: pgadmin.browser.server_groups.servers.pgagent.steps
2018-12-04 17:35:00,664: INFO pgadmin: Examining potential module: pgadmin.browser.server_groups.servers.pgagent.tests
2018-12-04 17:35:00,676: INFO pgadmin: Examining potential module: pgadmin.browser.server_groups.servers.resource_groups.tests
2018-12-04 17:35:00,681: INFO pgadmin: Examining potential module: pgadmin.browser.server_groups.servers.roles.tests
2018-12-04 17:35:00,686: INFO pgadmin: Examining potential module: pgadmin.browser.server_groups.servers.tablespaces.tests
2018-12-04 17:35:00,692: INFO pgadmin: Examining potential module: pgadmin.dashboard
2018-12-04 17:35:00,695: INFO pgadmin: Registering blueprint module: <pgadmin.dashboard.DashboardModule object at 0x7ff6e1e97890>
2018-12-04 17:35:00,695: INFO pgadmin: Examining potential module: pgadmin.dashboard.tests
2018-12-04 17:35:00,704: INFO pgadmin: Examining potential module: pgadmin.feature_tests
2018-12-04 17:35:00,705: INFO pgadmin: Examining potential module: pgadmin.help
2018-12-04 17:35:00,706: INFO pgadmin: Registering blueprint module: <pgadmin.help.HelpModule object at 0x7ff6e1ef6d50>
2018-12-04 17:35:00,706: INFO pgadmin: Examining potential module: pgadmin.misc
2018-12-04 17:35:00,707: INFO pgadmin: Registering blueprint module: <pgadmin.misc.MiscModule object at 0x7ff6e1e9f310>
2018-12-04 17:35:00,707: INFO pgadmin: Examining potential module: pgadmin.misc.bgprocess
2018-12-04 17:35:00,733: INFO pgadmin: Examining potential module: pgadmin.misc.depends
2018-12-04 17:35:00,733: INFO pgadmin: Examining potential module: pgadmin.misc.file_manager
2018-12-04 17:35:00,741: INFO pgadmin: Examining potential module: pgadmin.misc.sql
2018-12-04 17:35:00,742: INFO pgadmin: Examining potential module: pgadmin.misc.statistics
2018-12-04 17:35:00,744: INFO pgadmin: Examining potential module: pgadmin.misc.bgprocess.process_executor
2018-12-04 17:35:00,746: INFO pgadmin: Examining potential module: pgadmin.misc.bgprocess.processes
2018-12-04 17:35:00,752: INFO pgadmin: Examining potential module: pgadmin.model
2018-12-04 17:35:00,752: INFO pgadmin: Examining potential module: pgadmin.preferences
2018-12-04 17:35:00,754: INFO pgadmin: Registering blueprint module: <pgadmin.preferences.PreferencesModule object at 0x7ff6e189be90>
2018-12-04 17:35:00,756: INFO pgadmin: Examining potential module: pgadmin.redirects
2018-12-04 17:35:00,756: INFO pgadmin: Registering blueprint module: <pgadmin.utils.PgAdminModule object at 0x7ff6e18ac4d0>
2018-12-04 17:35:00,757: INFO pgadmin: Examining potential module: pgadmin.settings
2018-12-04 17:35:00,757: INFO pgadmin: Registering blueprint module: <pgadmin.settings.SettingsModule object at 0x7ff6e734a750>
2018-12-04 17:35:00,759: INFO pgadmin: Examining potential module: pgadmin.setup
2018-12-04 17:35:00,760: INFO pgadmin: Examining potential module: pgadmin.tools
2018-12-04 17:35:00,760: INFO pgadmin: Registering blueprint module: <pgadmin.tools.ToolsModule object at 0x7ff6e18ace50>
2018-12-04 17:35:00,761: INFO pgadmin: Examining potential module: pgadmin.tools.backup
2018-12-04 17:35:00,765: INFO pgadmin: Examining potential module: pgadmin.tools.datagrid
2018-12-04 17:35:00,832: INFO pgadmin: Examining potential module: pgadmin.tools.debugger
2018-12-04 17:35:00,842: INFO pgadmin: Examining potential module: pgadmin.tools.grant_wizard
2018-12-04 17:35:00,844: INFO pgadmin: Examining potential module: pgadmin.tools.import_export
2018-12-04 17:35:00,847: INFO pgadmin: Examining potential module: pgadmin.tools.maintenance
2018-12-04 17:35:00,849: INFO pgadmin: Examining potential module: pgadmin.tools.restore
2018-12-04 17:35:00,851: INFO pgadmin: Examining potential module: pgadmin.tools.sqleditor
2018-12-04 17:35:00,852: INFO pgadmin: Examining potential module: pgadmin.tools.user_management
2018-12-04 17:35:00,855: INFO pgadmin: Examining potential module: pgadmin.tools.backup.tests
2018-12-04 17:35:00,870: INFO pgadmin: Examining potential module: pgadmin.tools.import_export.tests
2018-12-04 17:35:00,872: INFO pgadmin: Examining potential module: pgadmin.tools.maintenance.tests
2018-12-04 17:35:00,873: INFO pgadmin: Examining potential module: pgadmin.tools.restore.tests
2018-12-04 17:35:00,875: INFO pgadmin: Examining potential module: pgadmin.tools.sqleditor.command
2018-12-04 17:35:00,875: INFO pgadmin: Examining potential module: pgadmin.tools.sqleditor.tests
2018-12-04 17:35:00,876: INFO pgadmin: Examining potential module: pgadmin.tools.sqleditor.utils
2018-12-04 17:35:00,883: INFO pgadmin: Examining potential module: pgadmin.utils
NOTE: Configuring authentication for DESKTOP mode.
pgAdmin 4 - Application Initialisation
======================================

Non-ASCII character '\xc5' in file <https://jenkins.pgadmin.org/job/pgadmin4-master-python27/ws/web/pgadmin/tools/sqleditor/tests/test_encoding_charset.py> on line 59, but no encoding declared; see http://python.org/dev/peps/pep-0263/ for details (test_encoding_charset.py, line 59)
ERROR: Error detected when running the Python tests.
ERROR: Error detected when running the Python tests.
Build step 'Execute shell' marked build as failure

Reply | Threaded
Open this post in threaded view
|

Build failed in Jenkins: pgadmin4-master-python27 #824

pgAdmin 4 Jenkins
See <https://jenkins.pgadmin.org/job/pgadmin4-master-python27/824/display/redirect?page=changes>

Changes:

[Dave Page] Run Postfix in the container build so passwords can be reset etc. Fixes

------------------------------------------
[...truncated 22.16 KB...]
Requirement already satisfied: testtools==2.3.0 in ./pgadmin-venv/lib/python2.7/site-packages (from -r web/regression/requirements.txt (line 12)) (2.3.0)
Requirement already satisfied: traceback2==1.4.0 in ./pgadmin-venv/lib/python2.7/site-packages (from -r web/regression/requirements.txt (line 13)) (1.4.0)
Requirement already satisfied: unittest2==1.1.0 in ./pgadmin-venv/lib/python2.7/site-packages (from -r web/regression/requirements.txt (line 14)) (1.1.0)
Collecting selenium==3.11.0 (from -r web/regression/requirements.txt (line 19))
  Using cached https://files.pythonhosted.org/packages/d4/28/8124d32415bd3d67fabea52480395427576b582771283e89ce10a56d9e5b/selenium-3.11.0.tar.gz
Collecting mock===2.0.0 (from -r web/regression/requirements.txt (line 29))
  Using cached https://files.pythonhosted.org/packages/0c/53/014354fc93c591ccc4abff12c473ad565a2eb24dcd82490fae33dbf2539f/mock-2.0.0.tar.gz
Collecting chromedriver_installer==0.0.6 (from -r web/regression/requirements.txt (line 33))
  Using cached https://files.pythonhosted.org/packages/c8/01/0a8a725bb605f68923aba16099a01cbbfe547c8b7dc96fd9a554424f6524/chromedriver_installer-0.0.6.tar.gz
Requirement already satisfied: itsdangerous>=0.21 in ./pgadmin-venv/lib/python2.7/site-packages (from Flask==0.12.4->-r web/regression/../../requirements.txt (line 9)) (1.1.0)
Requirement already satisfied: click>=2.0 in ./pgadmin-venv/lib/python2.7/site-packages (from Flask==0.12.4->-r web/regression/../../requirements.txt (line 9)) (7.0)
Requirement already satisfied: Werkzeug>=0.7 in ./pgadmin-venv/lib/python2.7/site-packages (from Flask==0.12.4->-r web/regression/../../requirements.txt (line 9)) (0.14.1)
Requirement already satisfied: Jinja2>=2.4 in ./pgadmin-venv/lib/python2.7/site-packages (from Flask==0.12.4->-r web/regression/../../requirements.txt (line 9)) (2.10)
Requirement already satisfied: alembic>=0.6 in ./pgadmin-venv/lib/python2.7/site-packages (from Flask-Migrate==2.1.1->-r web/regression/../../requirements.txt (line 13)) (1.0.5)
Requirement already satisfied: webencodings in ./pgadmin-venv/lib/python2.7/site-packages (from html5lib==1.0.1->-r web/regression/../../requirements.txt (line 17)) (0.5.1)
Requirement already satisfied: Flask-BabelEx>=0.9.3 in ./pgadmin-venv/lib/python2.7/site-packages (from Flask-Security>=3.0.0->-r web/regression/../../requirements.txt (line 41)) (0.9.3)
Requirement already satisfied: paramiko>=1.15.2 in ./pgadmin-venv/lib/python2.7/site-packages (from sshtunnel>=0.1.3->-r web/regression/../../requirements.txt (line 42)) (2.4.2)
Requirement already satisfied: argparse in ./pgadmin-venv/lib/python2.7/site-packages (from unittest2==1.1.0->-r web/regression/requirements.txt (line 14)) (1.4.0)
Collecting funcsigs>=1 (from mock===2.0.0->-r web/regression/requirements.txt (line 29))
  Using cached https://files.pythonhosted.org/packages/94/4a/db842e7a0545de1cdb0439bb80e6e42dfe82aaeaadd4072f2263a4fbed23/funcsigs-1.0.2.tar.gz
Requirement already satisfied: MarkupSafe>=0.23 in ./pgadmin-venv/lib/python2.7/site-packages (from Jinja2>=2.4->Flask==0.12.4->-r web/regression/../../requirements.txt (line 9)) (1.1.0)
Requirement already satisfied: python-editor>=0.3 in ./pgadmin-venv/lib/python2.7/site-packages (from alembic>=0.6->Flask-Migrate==2.1.1->-r web/regression/../../requirements.txt (line 13)) (1.0.3)
Requirement already satisfied: Mako in ./pgadmin-venv/lib/python2.7/site-packages (from alembic>=0.6->Flask-Migrate==2.1.1->-r web/regression/../../requirements.txt (line 13)) (1.0.7)
Requirement already satisfied: Babel>=1.0 in ./pgadmin-venv/lib/python2.7/site-packages (from Flask-BabelEx>=0.9.3->Flask-Security>=3.0.0->-r web/regression/../../requirements.txt (line 41)) (2.6.0)
Requirement already satisfied: pynacl>=1.0.1 in ./pgadmin-venv/lib/python2.7/site-packages (from paramiko>=1.15.2->sshtunnel>=0.1.3->-r web/regression/../../requirements.txt (line 42)) (1.3.0)
Requirement already satisfied: cryptography>=1.5 in ./pgadmin-venv/lib/python2.7/site-packages (from paramiko>=1.15.2->sshtunnel>=0.1.3->-r web/regression/../../requirements.txt (line 42)) (2.4.2)
Requirement already satisfied: bcrypt>=3.1.3 in ./pgadmin-venv/lib/python2.7/site-packages (from paramiko>=1.15.2->sshtunnel>=0.1.3->-r web/regression/../../requirements.txt (line 42)) (3.1.4)
Requirement already satisfied: pyasn1>=0.1.7 in ./pgadmin-venv/lib/python2.7/site-packages (from paramiko>=1.15.2->sshtunnel>=0.1.3->-r web/regression/../../requirements.txt (line 42)) (0.4.4)
Requirement already satisfied: cffi>=1.4.1 in ./pgadmin-venv/lib/python2.7/site-packages (from pynacl>=1.0.1->paramiko>=1.15.2->sshtunnel>=0.1.3->-r web/regression/../../requirements.txt (line 42)) (1.11.5)
Requirement already satisfied: idna>=2.1 in ./pgadmin-venv/lib/python2.7/site-packages (from cryptography>=1.5->paramiko>=1.15.2->sshtunnel>=0.1.3->-r web/regression/../../requirements.txt (line 42)) (2.8)
Requirement already satisfied: enum34; python_version < "3" in ./pgadmin-venv/lib/python2.7/site-packages (from cryptography>=1.5->paramiko>=1.15.2->sshtunnel>=0.1.3->-r web/regression/../../requirements.txt (line 42)) (1.1.6)
Requirement already satisfied: asn1crypto>=0.21.0 in ./pgadmin-venv/lib/python2.7/site-packages (from cryptography>=1.5->paramiko>=1.15.2->sshtunnel>=0.1.3->-r web/regression/../../requirements.txt (line 42)) (0.24.0)
Requirement already satisfied: ipaddress; python_version < "3" in ./pgadmin-venv/lib/python2.7/site-packages (from cryptography>=1.5->paramiko>=1.15.2->sshtunnel>=0.1.3->-r web/regression/../../requirements.txt (line 42)) (1.0.22)
Requirement already satisfied: pycparser in ./pgadmin-venv/lib/python2.7/site-packages (from cffi>=1.4.1->pynacl>=1.0.1->paramiko>=1.15.2->sshtunnel>=0.1.3->-r web/regression/../../requirements.txt (line 42)) (2.19)
Skipping bdist_wheel for pycodestyle, due to binaries being disabled for it.
Skipping bdist_wheel for pyperclip, due to binaries being disabled for it.
Skipping bdist_wheel for testscenarios, due to binaries being disabled for it.
Skipping bdist_wheel for selenium, due to binaries being disabled for it.
Skipping bdist_wheel for mock, due to binaries being disabled for it.
Skipping bdist_wheel for chromedriver-installer, due to binaries being disabled for it.
Skipping bdist_wheel for funcsigs, due to binaries being disabled for it.
Installing collected packages: pycodestyle, pyperclip, testscenarios, selenium, funcsigs, mock, chromedriver-installer
  Running setup.py install for pycodestyle: started
    Running setup.py install for pycodestyle: finished with status 'done'
  Running setup.py install for pyperclip: started
    Running setup.py install for pyperclip: finished with status 'done'
  Running setup.py install for testscenarios: started
    Running setup.py install for testscenarios: finished with status 'done'
  Running setup.py install for selenium: started
    Running setup.py install for selenium: finished with status 'done'
  Running setup.py install for funcsigs: started
    Running setup.py install for funcsigs: finished with status 'done'
  Running setup.py install for mock: started
    Running setup.py install for mock: finished with status 'done'
  Running setup.py install for chromedriver-installer: started
    Running setup.py install for chromedriver-installer: finished with status 'done'
Successfully installed chromedriver-installer-0.0.6 funcsigs-1.0.2 mock-2.0.0 pycodestyle-2.3.1 pyperclip-1.6.5 selenium-3.11.0 testscenarios-0.5.0
Running PEP-8 checks...

cd web && pycodestyle --config=.pycodestyle .
Running regression tests...

<https://jenkins.pgadmin.org/job/pgadmin4-master-python27/ws/pgadmin-venv/lib/python2.7/site-packages/psycopg2/__init__.py>:144: UserWarning: The psycopg2 wheel package will be renamed from release 2.8; in order to keep installing from binary please use "pip install psycopg2-binary" instead. For details see: <http://initd.org/psycopg/docs/install.html#binary-install-from-pypi>.
  """)
2018-12-05 14:58:29,542: INFO pgadmin: ########################################################
2018-12-05 14:58:29,543: INFO pgadmin: Starting pgAdmin 4 v3.6...
2018-12-05 14:58:29,543: INFO pgadmin: ########################################################
2018-12-05 14:58:29,543: DEBUG pgadmin: Python syspath: ['<https://jenkins.pgadmin.org/job/pgadmin4-master-python27/ws/web/regression',> '<https://jenkins.pgadmin.org/job/pgadmin4-master-python27/ws/web',> '<https://jenkins.pgadmin.org/job/pgadmin4-master-python27/ws/web/regression',> '<https://jenkins.pgadmin.org/job/pgadmin4-master-python27/ws/pgadmin-venv/lib/python27.zip',> '<https://jenkins.pgadmin.org/job/pgadmin4-master-python27/ws/pgadmin-venv/lib/python2.7',> '<https://jenkins.pgadmin.org/job/pgadmin4-master-python27/ws/pgadmin-venv/lib/python2.7/plat-linux2',> '<https://jenkins.pgadmin.org/job/pgadmin4-master-python27/ws/pgadmin-venv/lib/python2.7/lib-tk',> '<https://jenkins.pgadmin.org/job/pgadmin4-master-python27/ws/pgadmin-venv/lib/python2.7/lib-old',> '<https://jenkins.pgadmin.org/job/pgadmin4-master-python27/ws/pgadmin-venv/lib/python2.7/lib-dynload',> '/usr/local/python-2.7/lib/python2.7', '/usr/local/python-2.7/lib/python2.7/plat-linux2', '/usr/local/python-2.7/lib/python2.7/lib-tk', '<https://jenkins.pgadmin.org/job/pgadmin4-master-python27/ws/pgadmin-venv/lib/python2.7/site-packages']>
2018-12-05 14:58:29,543: DEBUG pgadmin: Available translations: [Locale('pl'), Locale('zh'), Locale('de'), Locale('ja'), Locale('ru'), Locale('fr'), Locale('ko'), Locale('es')]
2018-12-05 14:58:30,074: INFO pgadmin: Examining potential module: pgadmin.about
2018-12-05 14:58:30,075: INFO pgadmin: Registering blueprint module: <pgadmin.about.AboutModule object at 0x7f836eeae210>
2018-12-05 14:58:30,076: INFO pgadmin: Examining potential module: pgadmin.browser
2018-12-05 14:58:30,076: INFO pgadmin: Registering blueprint module: <pgadmin.browser.BrowserModule object at 0x7f8373409ed0>
2018-12-05 14:58:30,076: INFO pgadmin: Examining potential module: pgadmin.browser.collection
2018-12-05 14:58:30,076: INFO pgadmin: Examining potential module: pgadmin.browser.register_browser_preferences
2018-12-05 14:58:30,077: INFO pgadmin: Examining potential module: pgadmin.browser.server_groups
2018-12-05 14:58:30,077: INFO pgadmin: Examining potential module: pgadmin.browser.tests
2018-12-05 14:58:30,077: INFO pgadmin: Examining potential module: pgadmin.browser.utils
2018-12-05 14:58:30,079: INFO pgadmin: Examining potential module: pgadmin.browser.server_groups.servers
2018-12-05 14:58:30,080: INFO pgadmin: Examining potential module: pgadmin.browser.server_groups.tests
2018-12-05 14:58:30,083: INFO pgadmin: Examining potential module: pgadmin.browser.server_groups.servers.databases
2018-12-05 14:58:30,083: INFO pgadmin: Examining potential module: pgadmin.browser.server_groups.servers.gpdb
2018-12-05 14:58:30,084: INFO pgadmin: Examining potential module: pgadmin.browser.server_groups.servers.pgagent
2018-12-05 14:58:30,088: INFO pgadmin: Examining potential module: pgadmin.browser.server_groups.servers.ppas
2018-12-05 14:58:30,088: INFO pgadmin: Examining potential module: pgadmin.browser.server_groups.servers.resource_groups
2018-12-05 14:58:30,092: INFO pgadmin: Examining potential module: pgadmin.browser.server_groups.servers.roles
2018-12-05 14:58:30,092: INFO pgadmin: Examining potential module: pgadmin.browser.server_groups.servers.tablespaces
2018-12-05 14:58:30,092: INFO pgadmin: Examining potential module: pgadmin.browser.server_groups.servers.tests
2018-12-05 14:58:30,093: INFO pgadmin: Examining potential module: pgadmin.browser.server_groups.servers.types
2018-12-05 14:58:30,093: INFO pgadmin: Examining potential module: pgadmin.browser.server_groups.servers.utils
2018-12-05 14:58:30,099: INFO pgadmin: Examining potential module: pgadmin.browser.server_groups.servers.databases.casts
2018-12-05 14:58:30,103: INFO pgadmin: Examining potential module: pgadmin.browser.server_groups.servers.databases.event_triggers
2018-12-05 14:58:30,106: INFO pgadmin: Examining potential module: pgadmin.browser.server_groups.servers.databases.extensions
2018-12-05 14:58:30,109: INFO pgadmin: Examining potential module: pgadmin.browser.server_groups.servers.databases.external_tables
2018-12-05 14:58:30,114: INFO pgadmin: Examining potential module: pgadmin.browser.server_groups.servers.databases.foreign_data_wrappers
2018-12-05 14:58:30,118: INFO pgadmin: Examining potential module: pgadmin.browser.server_groups.servers.databases.languages
2018-12-05 14:58:30,122: INFO pgadmin: Examining potential module: pgadmin.browser.server_groups.servers.databases.schemas
2018-12-05 14:58:30,122: INFO pgadmin: Examining potential module: pgadmin.browser.server_groups.servers.databases.tests
2018-12-05 14:58:30,123: INFO pgadmin: Examining potential module: pgadmin.browser.server_groups.servers.databases.utils
2018-12-05 14:58:30,131: INFO pgadmin: Examining potential module: pgadmin.browser.server_groups.servers.databases.casts.tests
2018-12-05 14:58:30,139: INFO pgadmin: Examining potential module: pgadmin.browser.server_groups.servers.databases.event_triggers.tests
2018-12-05 14:58:30,145: INFO pgadmin: Examining potential module: pgadmin.browser.server_groups.servers.databases.extensions.tests
2018-12-05 14:58:30,152: INFO pgadmin: Examining potential module: pgadmin.browser.server_groups.servers.databases.external_tables.actions
2018-12-05 14:58:30,153: INFO pgadmin: Examining potential module: pgadmin.browser.server_groups.servers.databases.external_tables.mapping_utils
2018-12-05 14:58:30,153: INFO pgadmin: Examining potential module: pgadmin.browser.server_groups.servers.databases.external_tables.properties
2018-12-05 14:58:30,153: INFO pgadmin: Examining potential module: pgadmin.browser.server_groups.servers.databases.external_tables.reverse_engineer_ddl
2018-12-05 14:58:30,153: INFO pgadmin: Examining potential module: pgadmin.browser.server_groups.servers.databases.external_tables.tests
2018-12-05 14:58:30,156: INFO pgadmin: Examining potential module: pgadmin.browser.server_groups.servers.databases.foreign_data_wrappers.foreign_servers
2018-12-05 14:58:30,161: INFO pgadmin: Examining potential module: pgadmin.browser.server_groups.servers.databases.foreign_data_wrappers.tests
2018-12-05 14:58:30,169: INFO pgadmin: Examining potential module: pgadmin.browser.server_groups.servers.databases.foreign_data_wrappers.foreign_servers.tests
2018-12-05 14:58:30,169: INFO pgadmin: Examining potential module: pgadmin.browser.server_groups.servers.databases.foreign_data_wrappers.foreign_servers.user_mapping
2018-12-05 14:58:30,180: INFO pgadmin: Examining potential module: pgadmin.browser.server_groups.servers.databases.foreign_data_wrappers.foreign_servers.user_mapping.tests
2018-12-05 14:58:30,188: INFO pgadmin: Examining potential module: pgadmin.browser.server_groups.servers.databases.languages.tests
2018-12-05 14:58:30,195: INFO pgadmin: Examining potential module: pgadmin.browser.server_groups.servers.databases.schemas.catalog_objects
2018-12-05 14:58:30,197: INFO pgadmin: Examining potential module: pgadmin.browser.server_groups.servers.databases.schemas.collations
2018-12-05 14:58:30,200: INFO pgadmin: Examining potential module: pgadmin.browser.server_groups.servers.databases.schemas.domains
2018-12-05 14:58:30,204: INFO pgadmin: Examining potential module: pgadmin.browser.server_groups.servers.databases.schemas.foreign_tables
2018-12-05 14:58:30,211: INFO pgadmin: Examining potential module: pgadmin.browser.server_groups.servers.databases.schemas.fts_configurations
2018-12-05 14:58:30,215: INFO pgadmin: Examining potential module: pgadmin.browser.server_groups.servers.databases.schemas.fts_dictionaries
2018-12-05 14:58:30,219: INFO pgadmin: Examining potential module: pgadmin.browser.server_groups.servers.databases.schemas.fts_parser
2018-12-05 14:58:30,224: INFO pgadmin: Examining potential module: pgadmin.browser.server_groups.servers.databases.schemas.fts_templates
2018-12-05 14:58:30,228: INFO pgadmin: Examining potential module: pgadmin.browser.server_groups.servers.databases.schemas.functions
2018-12-05 14:58:30,228: INFO pgadmin: Examining potential module: pgadmin.browser.server_groups.servers.databases.schemas.packages
2018-12-05 14:58:30,232: INFO pgadmin: Examining potential module: pgadmin.browser.server_groups.servers.databases.schemas.sequences
2018-12-05 14:58:30,237: INFO pgadmin: Examining potential module: pgadmin.browser.server_groups.servers.databases.schemas.synonyms
2018-12-05 14:58:30,240: INFO pgadmin: Examining potential module: pgadmin.browser.server_groups.servers.databases.schemas.tables
2018-12-05 14:58:30,259: INFO pgadmin: Examining potential module: pgadmin.browser.server_groups.servers.databases.schemas.tests
2018-12-05 14:58:30,260: INFO pgadmin: Examining potential module: pgadmin.browser.server_groups.servers.databases.schemas.types
2018-12-05 14:58:30,266: INFO pgadmin: Examining potential module: pgadmin.browser.server_groups.servers.databases.schemas.utils
2018-12-05 14:58:30,267: INFO pgadmin: Examining potential module: pgadmin.browser.server_groups.servers.databases.schemas.views
2018-12-05 14:58:30,281: INFO pgadmin: Examining potential module: pgadmin.browser.server_groups.servers.databases.schemas.catalog_objects.columns
2018-12-05 14:58:30,292: INFO pgadmin: Examining potential module: pgadmin.browser.server_groups.servers.databases.schemas.collations.tests
2018-12-05 14:58:30,300: INFO pgadmin: Examining potential module: pgadmin.browser.server_groups.servers.databases.schemas.domains.domain_constraints
2018-12-05 14:58:30,304: INFO pgadmin: Examining potential module: pgadmin.browser.server_groups.servers.databases.schemas.domains.tests
2018-12-05 14:58:30,320: INFO pgadmin: Examining potential module: pgadmin.browser.server_groups.servers.databases.schemas.foreign_tables.tests
2018-12-05 14:58:30,334: INFO pgadmin: Examining potential module: pgadmin.browser.server_groups.servers.databases.schemas.fts_configurations.tests
2018-12-05 14:58:30,345: INFO pgadmin: Examining potential module: pgadmin.browser.server_groups.servers.databases.schemas.fts_dictionaries.tests
2018-12-05 14:58:30,354: INFO pgadmin: Examining potential module: pgadmin.browser.server_groups.servers.databases.schemas.fts_parser.tests
2018-12-05 14:58:30,366: INFO pgadmin: Examining potential module: pgadmin.browser.server_groups.servers.databases.schemas.fts_templates.tests
2018-12-05 14:58:30,375: INFO pgadmin: Examining potential module: pgadmin.browser.server_groups.servers.databases.schemas.functions.tests
2018-12-05 14:58:30,386: INFO pgadmin: Examining potential module: pgadmin.browser.server_groups.servers.databases.schemas.functions.tests
2018-12-05 14:58:30,397: INFO pgadmin: Examining potential module: pgadmin.browser.server_groups.servers.databases.schemas.functions.tests
2018-12-05 14:58:30,408: INFO pgadmin: Examining potential module: pgadmin.browser.server_groups.servers.databases.schemas.packages.edbfuncs
2018-12-05 14:58:30,412: INFO pgadmin: Examining potential module: pgadmin.browser.server_groups.servers.databases.schemas.packages.edbvars
2018-12-05 14:58:30,414: INFO pgadmin: Examining potential module: pgadmin.browser.server_groups.servers.databases.schemas.packages.tests
2018-12-05 14:58:30,421: INFO pgadmin: Examining potential module: pgadmin.browser.server_groups.servers.databases.schemas.packages.edbfuncs.tests
2018-12-05 14:58:30,427: INFO pgadmin: Examining potential module: pgadmin.browser.server_groups.servers.databases.schemas.packages.edbfuncs.tests
2018-12-05 14:58:30,434: INFO pgadmin: Examining potential module: pgadmin.browser.server_groups.servers.databases.schemas.sequences.tests
2018-12-05 14:58:30,472: INFO pgadmin: Examining potential module: pgadmin.browser.server_groups.servers.databases.schemas.synonyms.tests
2018-12-05 14:58:30,480: INFO pgadmin: Examining potential module: pgadmin.browser.server_groups.servers.databases.schemas.tables.base_partition_table
2018-12-05 14:58:30,480: INFO pgadmin: Examining potential module: pgadmin.browser.server_groups.servers.databases.schemas.tables.column
2018-12-05 14:58:30,486: INFO pgadmin: Examining potential module: pgadmin.browser.server_groups.servers.databases.schemas.tables.constraints
2018-12-05 14:58:30,488: INFO pgadmin: Examining potential module: pgadmin.browser.server_groups.servers.databases.schemas.tables.indexes
2018-12-05 14:58:30,497: INFO pgadmin: Examining potential module: pgadmin.browser.server_groups.servers.databases.schemas.tables.partitions
2018-12-05 14:58:30,497: INFO pgadmin: Examining potential module: pgadmin.browser.server_groups.servers.databases.schemas.tables.rules
2018-12-05 14:58:30,500: INFO pgadmin: Examining potential module: pgadmin.browser.server_groups.servers.databases.schemas.tables.tests
2018-12-05 14:58:30,501: INFO pgadmin: Examining potential module: pgadmin.browser.server_groups.servers.databases.schemas.tables.triggers
2018-12-05 14:58:30,506: INFO pgadmin: Examining potential module: pgadmin.browser.server_groups.servers.databases.schemas.tables.utils
2018-12-05 14:58:30,526: INFO pgadmin: Examining potential module: pgadmin.browser.server_groups.servers.databases.schemas.tables.column.tests
2018-12-05 14:58:30,533: INFO pgadmin: Examining potential module: pgadmin.browser.server_groups.servers.databases.schemas.tables.constraints.check_constraint
2018-12-05 14:58:30,539: INFO pgadmin: Examining potential module: pgadmin.browser.server_groups.servers.databases.schemas.tables.constraints.exclusion_constraint
2018-12-05 14:58:30,545: INFO pgadmin: Examining potential module: pgadmin.browser.server_groups.servers.databases.schemas.tables.constraints.foreign_key
2018-12-05 14:58:30,551: INFO pgadmin: Examining potential module: pgadmin.browser.server_groups.servers.databases.schemas.tables.constraints.index_constraint
2018-12-05 14:58:30,559: INFO pgadmin: Examining potential module: pgadmin.browser.server_groups.servers.databases.schemas.tables.constraints.tests
2018-12-05 14:58:30,559: INFO pgadmin: Examining potential module: pgadmin.browser.server_groups.servers.databases.schemas.tables.constraints.type
2018-12-05 14:58:30,561: INFO pgadmin: Examining potential module: pgadmin.browser.server_groups.servers.databases.schemas.tables.constraints.check_constraint.tests
2018-12-05 14:58:30,602: INFO pgadmin: Examining potential module: pgadmin.browser.server_groups.servers.databases.schemas.tables.indexes.tests
2018-12-05 14:58:30,613: INFO pgadmin: Examining potential module: pgadmin.browser.server_groups.servers.databases.schemas.tables.partitions.tests
2018-12-05 14:58:30,614: INFO pgadmin: Examining potential module: pgadmin.browser.server_groups.servers.databases.schemas.tables.partitions.tests
2018-12-05 14:58:30,620: INFO pgadmin: Examining potential module: pgadmin.browser.server_groups.servers.databases.schemas.tables.rules.tests
2018-12-05 14:58:30,628: INFO pgadmin: Examining potential module: pgadmin.browser.server_groups.servers.databases.schemas.tables.triggers.tests
2018-12-05 14:58:30,638: INFO pgadmin: Examining potential module: pgadmin.browser.server_groups.servers.databases.schemas.types.tests
2018-12-05 14:58:30,652: INFO pgadmin: Examining potential module: pgadmin.browser.server_groups.servers.databases.schemas.views.children
2018-12-05 14:58:30,652: INFO pgadmin: Examining potential module: pgadmin.browser.server_groups.servers.databases.schemas.views.tests
2018-12-05 14:58:30,699: INFO pgadmin: Examining potential module: pgadmin.browser.server_groups.servers.databases.schemas.views.children
2018-12-05 14:58:30,699: INFO pgadmin: Examining potential module: pgadmin.browser.server_groups.servers.databases.schemas.views.tests
2018-12-05 14:58:30,746: INFO pgadmin: Examining potential module: pgadmin.browser.server_groups.servers.databases.schemas.catalog_objects
2018-12-05 14:58:30,746: INFO pgadmin: Examining potential module: pgadmin.browser.server_groups.servers.databases.schemas.collations
2018-12-05 14:58:30,746: INFO pgadmin: Examining potential module: pgadmin.browser.server_groups.servers.databases.schemas.domains
2018-12-05 14:58:30,746: INFO pgadmin: Examining potential module: pgadmin.browser.server_groups.servers.databases.schemas.foreign_tables
2018-12-05 14:58:30,747: INFO pgadmin: Examining potential module: pgadmin.browser.server_groups.servers.databases.schemas.fts_configurations
2018-12-05 14:58:30,747: INFO pgadmin: Examining potential module: pgadmin.browser.server_groups.servers.databases.schemas.fts_dictionaries
2018-12-05 14:58:30,747: INFO pgadmin: Examining potential module: pgadmin.browser.server_groups.servers.databases.schemas.fts_parser
2018-12-05 14:58:30,747: INFO pgadmin: Examining potential module: pgadmin.browser.server_groups.servers.databases.schemas.fts_templates
2018-12-05 14:58:30,747: INFO pgadmin: Examining potential module: pgadmin.browser.server_groups.servers.databases.schemas.functions
2018-12-05 14:58:30,747: INFO pgadmin: Examining potential module: pgadmin.browser.server_groups.servers.databases.schemas.packages
2018-12-05 14:58:30,748: INFO pgadmin: Examining potential module: pgadmin.browser.server_groups.servers.databases.schemas.sequences
2018-12-05 14:58:30,748: INFO pgadmin: Examining potential module: pgadmin.browser.server_groups.servers.databases.schemas.synonyms
2018-12-05 14:58:30,748: INFO pgadmin: Examining potential module: pgadmin.browser.server_groups.servers.databases.schemas.tables
2018-12-05 14:58:30,748: INFO pgadmin: Examining potential module: pgadmin.browser.server_groups.servers.databases.schemas.tests
2018-12-05 14:58:30,748: INFO pgadmin: Examining potential module: pgadmin.browser.server_groups.servers.databases.schemas.types
2018-12-05 14:58:30,749: INFO pgadmin: Examining potential module: pgadmin.browser.server_groups.servers.databases.schemas.utils
2018-12-05 14:58:30,749: INFO pgadmin: Examining potential module: pgadmin.browser.server_groups.servers.databases.schemas.views
2018-12-05 14:58:31,232: INFO pgadmin: Examining potential module: pgadmin.browser.server_groups.servers.pgagent.schedules
2018-12-05 14:58:31,235: INFO pgadmin: Examining potential module: pgadmin.browser.server_groups.servers.pgagent.steps
2018-12-05 14:58:31,238: INFO pgadmin: Examining potential module: pgadmin.browser.server_groups.servers.pgagent.tests
2018-12-05 14:58:31,250: INFO pgadmin: Examining potential module: pgadmin.browser.server_groups.servers.resource_groups.tests
2018-12-05 14:58:31,255: INFO pgadmin: Examining potential module: pgadmin.browser.server_groups.servers.roles.tests
2018-12-05 14:58:31,261: INFO pgadmin: Examining potential module: pgadmin.browser.server_groups.servers.tablespaces.tests
2018-12-05 14:58:31,267: INFO pgadmin: Examining potential module: pgadmin.dashboard
2018-12-05 14:58:31,270: INFO pgadmin: Registering blueprint module: <pgadmin.dashboard.DashboardModule object at 0x7f836df56890>
2018-12-05 14:58:31,270: INFO pgadmin: Examining potential module: pgadmin.dashboard.tests
2018-12-05 14:58:31,279: INFO pgadmin: Examining potential module: pgadmin.feature_tests
2018-12-05 14:58:31,279: INFO pgadmin: Examining potential module: pgadmin.help
2018-12-05 14:58:31,280: INFO pgadmin: Registering blueprint module: <pgadmin.help.HelpModule object at 0x7f836dfb5d50>
2018-12-05 14:58:31,281: INFO pgadmin: Examining potential module: pgadmin.misc
2018-12-05 14:58:31,282: INFO pgadmin: Registering blueprint module: <pgadmin.misc.MiscModule object at 0x7f836df5e310>
2018-12-05 14:58:31,282: INFO pgadmin: Examining potential module: pgadmin.misc.bgprocess
2018-12-05 14:58:31,308: INFO pgadmin: Examining potential module: pgadmin.misc.depends
2018-12-05 14:58:31,308: INFO pgadmin: Examining potential module: pgadmin.misc.file_manager
2018-12-05 14:58:31,316: INFO pgadmin: Examining potential module: pgadmin.misc.sql
2018-12-05 14:58:31,317: INFO pgadmin: Examining potential module: pgadmin.misc.statistics
2018-12-05 14:58:31,318: INFO pgadmin: Examining potential module: pgadmin.misc.bgprocess.process_executor
2018-12-05 14:58:31,321: INFO pgadmin: Examining potential module: pgadmin.misc.bgprocess.processes
2018-12-05 14:58:31,327: INFO pgadmin: Examining potential module: pgadmin.model
2018-12-05 14:58:31,327: INFO pgadmin: Examining potential module: pgadmin.preferences
2018-12-05 14:58:31,329: INFO pgadmin: Registering blueprint module: <pgadmin.preferences.PreferencesModule object at 0x7f836d95ae90>
2018-12-05 14:58:31,330: INFO pgadmin: Examining potential module: pgadmin.redirects
2018-12-05 14:58:31,331: INFO pgadmin: Registering blueprint module: <pgadmin.utils.PgAdminModule object at 0x7f836d96b4d0>
2018-12-05 14:58:31,332: INFO pgadmin: Examining potential module: pgadmin.settings
2018-12-05 14:58:31,332: INFO pgadmin: Registering blueprint module: <pgadmin.settings.SettingsModule object at 0x7f8373409750>
2018-12-05 14:58:31,334: INFO pgadmin: Examining potential module: pgadmin.setup
2018-12-05 14:58:31,334: INFO pgadmin: Examining potential module: pgadmin.tools
2018-12-05 14:58:31,335: INFO pgadmin: Registering blueprint module: <pgadmin.tools.ToolsModule object at 0x7f836d96be50>
2018-12-05 14:58:31,335: INFO pgadmin: Examining potential module: pgadmin.tools.backup
2018-12-05 14:58:31,338: INFO pgadmin: Examining potential module: pgadmin.tools.datagrid
2018-12-05 14:58:31,404: INFO pgadmin: Examining potential module: pgadmin.tools.debugger
2018-12-05 14:58:31,413: INFO pgadmin: Examining potential module: pgadmin.tools.grant_wizard
2018-12-05 14:58:31,416: INFO pgadmin: Examining potential module: pgadmin.tools.import_export
2018-12-05 14:58:31,418: INFO pgadmin: Examining potential module: pgadmin.tools.maintenance
2018-12-05 14:58:31,420: INFO pgadmin: Examining potential module: pgadmin.tools.restore
2018-12-05 14:58:31,423: INFO pgadmin: Examining potential module: pgadmin.tools.sqleditor
2018-12-05 14:58:31,423: INFO pgadmin: Examining potential module: pgadmin.tools.user_management
2018-12-05 14:58:31,426: INFO pgadmin: Examining potential module: pgadmin.tools.backup.tests
2018-12-05 14:58:31,441: INFO pgadmin: Examining potential module: pgadmin.tools.import_export.tests
2018-12-05 14:58:31,443: INFO pgadmin: Examining potential module: pgadmin.tools.maintenance.tests
2018-12-05 14:58:31,444: INFO pgadmin: Examining potential module: pgadmin.tools.restore.tests
2018-12-05 14:58:31,446: INFO pgadmin: Examining potential module: pgadmin.tools.sqleditor.command
2018-12-05 14:58:31,446: INFO pgadmin: Examining potential module: pgadmin.tools.sqleditor.tests
2018-12-05 14:58:31,446: INFO pgadmin: Examining potential module: pgadmin.tools.sqleditor.utils
2018-12-05 14:58:31,454: INFO pgadmin: Examining potential module: pgadmin.utils
NOTE: Configuring authentication for DESKTOP mode.
pgAdmin 4 - Application Initialisation
======================================

Non-ASCII character '\xc5' in file <https://jenkins.pgadmin.org/job/pgadmin4-master-python27/ws/web/pgadmin/tools/sqleditor/tests/test_encoding_charset.py> on line 59, but no encoding declared; see http://python.org/dev/peps/pep-0263/ for details (test_encoding_charset.py, line 59)
ERROR: Error detected when running the Python tests.
ERROR: Error detected when running the Python tests.
Build step 'Execute shell' marked build as failure

Reply | Threaded
Open this post in threaded view
|

Build failed in Jenkins: pgadmin4-master-python27 #825

pgAdmin 4 Jenkins
See <https://jenkins.pgadmin.org/job/pgadmin4-master-python27/825/display/redirect?page=changes>

Changes:

[Dave Page] Allow servers to be pre-loaded into container deployments. Fixes #3801

------------------------------------------
[...truncated 22.20 KB...]
Requirement already satisfied: testtools==2.3.0 in ./pgadmin-venv/lib/python2.7/site-packages (from -r web/regression/requirements.txt (line 12)) (2.3.0)
Requirement already satisfied: traceback2==1.4.0 in ./pgadmin-venv/lib/python2.7/site-packages (from -r web/regression/requirements.txt (line 13)) (1.4.0)
Requirement already satisfied: unittest2==1.1.0 in ./pgadmin-venv/lib/python2.7/site-packages (from -r web/regression/requirements.txt (line 14)) (1.1.0)
Collecting selenium==3.11.0 (from -r web/regression/requirements.txt (line 19))
  Using cached https://files.pythonhosted.org/packages/d4/28/8124d32415bd3d67fabea52480395427576b582771283e89ce10a56d9e5b/selenium-3.11.0.tar.gz
Collecting mock===2.0.0 (from -r web/regression/requirements.txt (line 29))
  Using cached https://files.pythonhosted.org/packages/0c/53/014354fc93c591ccc4abff12c473ad565a2eb24dcd82490fae33dbf2539f/mock-2.0.0.tar.gz
Collecting chromedriver_installer==0.0.6 (from -r web/regression/requirements.txt (line 33))
  Using cached https://files.pythonhosted.org/packages/c8/01/0a8a725bb605f68923aba16099a01cbbfe547c8b7dc96fd9a554424f6524/chromedriver_installer-0.0.6.tar.gz
Requirement already satisfied: itsdangerous>=0.21 in ./pgadmin-venv/lib/python2.7/site-packages (from Flask==0.12.4->-r web/regression/../../requirements.txt (line 9)) (1.1.0)
Requirement already satisfied: click>=2.0 in ./pgadmin-venv/lib/python2.7/site-packages (from Flask==0.12.4->-r web/regression/../../requirements.txt (line 9)) (7.0)
Requirement already satisfied: Werkzeug>=0.7 in ./pgadmin-venv/lib/python2.7/site-packages (from Flask==0.12.4->-r web/regression/../../requirements.txt (line 9)) (0.14.1)
Requirement already satisfied: Jinja2>=2.4 in ./pgadmin-venv/lib/python2.7/site-packages (from Flask==0.12.4->-r web/regression/../../requirements.txt (line 9)) (2.10)
Requirement already satisfied: alembic>=0.6 in ./pgadmin-venv/lib/python2.7/site-packages (from Flask-Migrate==2.1.1->-r web/regression/../../requirements.txt (line 13)) (1.0.5)
Requirement already satisfied: webencodings in ./pgadmin-venv/lib/python2.7/site-packages (from html5lib==1.0.1->-r web/regression/../../requirements.txt (line 17)) (0.5.1)
Requirement already satisfied: Flask-BabelEx>=0.9.3 in ./pgadmin-venv/lib/python2.7/site-packages (from Flask-Security>=3.0.0->-r web/regression/../../requirements.txt (line 41)) (0.9.3)
Requirement already satisfied: paramiko>=1.15.2 in ./pgadmin-venv/lib/python2.7/site-packages (from sshtunnel>=0.1.3->-r web/regression/../../requirements.txt (line 42)) (2.4.2)
Requirement already satisfied: argparse in ./pgadmin-venv/lib/python2.7/site-packages (from unittest2==1.1.0->-r web/regression/requirements.txt (line 14)) (1.4.0)
Collecting funcsigs>=1 (from mock===2.0.0->-r web/regression/requirements.txt (line 29))
  Using cached https://files.pythonhosted.org/packages/94/4a/db842e7a0545de1cdb0439bb80e6e42dfe82aaeaadd4072f2263a4fbed23/funcsigs-1.0.2.tar.gz
Requirement already satisfied: MarkupSafe>=0.23 in ./pgadmin-venv/lib/python2.7/site-packages (from Jinja2>=2.4->Flask==0.12.4->-r web/regression/../../requirements.txt (line 9)) (1.1.0)
Requirement already satisfied: python-editor>=0.3 in ./pgadmin-venv/lib/python2.7/site-packages (from alembic>=0.6->Flask-Migrate==2.1.1->-r web/regression/../../requirements.txt (line 13)) (1.0.3)
Requirement already satisfied: Mako in ./pgadmin-venv/lib/python2.7/site-packages (from alembic>=0.6->Flask-Migrate==2.1.1->-r web/regression/../../requirements.txt (line 13)) (1.0.7)
Requirement already satisfied: Babel>=1.0 in ./pgadmin-venv/lib/python2.7/site-packages (from Flask-BabelEx>=0.9.3->Flask-Security>=3.0.0->-r web/regression/../../requirements.txt (line 41)) (2.6.0)
Requirement already satisfied: pynacl>=1.0.1 in ./pgadmin-venv/lib/python2.7/site-packages (from paramiko>=1.15.2->sshtunnel>=0.1.3->-r web/regression/../../requirements.txt (line 42)) (1.3.0)
Requirement already satisfied: cryptography>=1.5 in ./pgadmin-venv/lib/python2.7/site-packages (from paramiko>=1.15.2->sshtunnel>=0.1.3->-r web/regression/../../requirements.txt (line 42)) (2.4.2)
Requirement already satisfied: bcrypt>=3.1.3 in ./pgadmin-venv/lib/python2.7/site-packages (from paramiko>=1.15.2->sshtunnel>=0.1.3->-r web/regression/../../requirements.txt (line 42)) (3.1.4)
Requirement already satisfied: pyasn1>=0.1.7 in ./pgadmin-venv/lib/python2.7/site-packages (from paramiko>=1.15.2->sshtunnel>=0.1.3->-r web/regression/../../requirements.txt (line 42)) (0.4.4)
Requirement already satisfied: cffi>=1.4.1 in ./pgadmin-venv/lib/python2.7/site-packages (from pynacl>=1.0.1->paramiko>=1.15.2->sshtunnel>=0.1.3->-r web/regression/../../requirements.txt (line 42)) (1.11.5)
Requirement already satisfied: idna>=2.1 in ./pgadmin-venv/lib/python2.7/site-packages (from cryptography>=1.5->paramiko>=1.15.2->sshtunnel>=0.1.3->-r web/regression/../../requirements.txt (line 42)) (2.8)
Requirement already satisfied: enum34; python_version < "3" in ./pgadmin-venv/lib/python2.7/site-packages (from cryptography>=1.5->paramiko>=1.15.2->sshtunnel>=0.1.3->-r web/regression/../../requirements.txt (line 42)) (1.1.6)
Requirement already satisfied: asn1crypto>=0.21.0 in ./pgadmin-venv/lib/python2.7/site-packages (from cryptography>=1.5->paramiko>=1.15.2->sshtunnel>=0.1.3->-r web/regression/../../requirements.txt (line 42)) (0.24.0)
Requirement already satisfied: ipaddress; python_version < "3" in ./pgadmin-venv/lib/python2.7/site-packages (from cryptography>=1.5->paramiko>=1.15.2->sshtunnel>=0.1.3->-r web/regression/../../requirements.txt (line 42)) (1.0.22)
Requirement already satisfied: pycparser in ./pgadmin-venv/lib/python2.7/site-packages (from cffi>=1.4.1->pynacl>=1.0.1->paramiko>=1.15.2->sshtunnel>=0.1.3->-r web/regression/../../requirements.txt (line 42)) (2.19)
Skipping bdist_wheel for pycodestyle, due to binaries being disabled for it.
Skipping bdist_wheel for pyperclip, due to binaries being disabled for it.
Skipping bdist_wheel for testscenarios, due to binaries being disabled for it.
Skipping bdist_wheel for selenium, due to binaries being disabled for it.
Skipping bdist_wheel for mock, due to binaries being disabled for it.
Skipping bdist_wheel for chromedriver-installer, due to binaries being disabled for it.
Skipping bdist_wheel for funcsigs, due to binaries being disabled for it.
Installing collected packages: pycodestyle, pyperclip, testscenarios, selenium, funcsigs, mock, chromedriver-installer
  Running setup.py install for pycodestyle: started
    Running setup.py install for pycodestyle: finished with status 'done'
  Running setup.py install for pyperclip: started
    Running setup.py install for pyperclip: finished with status 'done'
  Running setup.py install for testscenarios: started
    Running setup.py install for testscenarios: finished with status 'done'
  Running setup.py install for selenium: started
    Running setup.py install for selenium: finished with status 'done'
  Running setup.py install for funcsigs: started
    Running setup.py install for funcsigs: finished with status 'done'
  Running setup.py install for mock: started
    Running setup.py install for mock: finished with status 'done'
  Running setup.py install for chromedriver-installer: started
    Running setup.py install for chromedriver-installer: finished with status 'done'
Successfully installed chromedriver-installer-0.0.6 funcsigs-1.0.2 mock-2.0.0 pycodestyle-2.3.1 pyperclip-1.6.5 selenium-3.11.0 testscenarios-0.5.0
Running PEP-8 checks...

cd web && pycodestyle --config=.pycodestyle .
Running regression tests...

<https://jenkins.pgadmin.org/job/pgadmin4-master-python27/ws/pgadmin-venv/lib/python2.7/site-packages/psycopg2/__init__.py>:144: UserWarning: The psycopg2 wheel package will be renamed from release 2.8; in order to keep installing from binary please use "pip install psycopg2-binary" instead. For details see: <http://initd.org/psycopg/docs/install.html#binary-install-from-pypi>.
  """)
2018-12-05 17:45:01,564: INFO pgadmin: ########################################################
2018-12-05 17:45:01,564: INFO pgadmin: Starting pgAdmin 4 v3.6...
2018-12-05 17:45:01,564: INFO pgadmin: ########################################################
2018-12-05 17:45:01,564: DEBUG pgadmin: Python syspath: ['<https://jenkins.pgadmin.org/job/pgadmin4-master-python27/ws/web/regression',> '<https://jenkins.pgadmin.org/job/pgadmin4-master-python27/ws/web',> '<https://jenkins.pgadmin.org/job/pgadmin4-master-python27/ws/web/regression',> '<https://jenkins.pgadmin.org/job/pgadmin4-master-python27/ws/pgadmin-venv/lib/python27.zip',> '<https://jenkins.pgadmin.org/job/pgadmin4-master-python27/ws/pgadmin-venv/lib/python2.7',> '<https://jenkins.pgadmin.org/job/pgadmin4-master-python27/ws/pgadmin-venv/lib/python2.7/plat-linux2',> '<https://jenkins.pgadmin.org/job/pgadmin4-master-python27/ws/pgadmin-venv/lib/python2.7/lib-tk',> '<https://jenkins.pgadmin.org/job/pgadmin4-master-python27/ws/pgadmin-venv/lib/python2.7/lib-old',> '<https://jenkins.pgadmin.org/job/pgadmin4-master-python27/ws/pgadmin-venv/lib/python2.7/lib-dynload',> '/usr/local/python-2.7/lib/python2.7', '/usr/local/python-2.7/lib/python2.7/plat-linux2', '/usr/local/python-2.7/lib/python2.7/lib-tk', '<https://jenkins.pgadmin.org/job/pgadmin4-master-python27/ws/pgadmin-venv/lib/python2.7/site-packages']>
2018-12-05 17:45:01,565: DEBUG pgadmin: Available translations: [Locale('pl'), Locale('zh'), Locale('de'), Locale('ja'), Locale('ru'), Locale('fr'), Locale('ko'), Locale('es')]
2018-12-05 17:45:02,102: INFO pgadmin: Examining potential module: pgadmin.about
2018-12-05 17:45:02,103: INFO pgadmin: Registering blueprint module: <pgadmin.about.AboutModule object at 0x7f5ef3b5c210>
2018-12-05 17:45:02,104: INFO pgadmin: Examining potential module: pgadmin.browser
2018-12-05 17:45:02,104: INFO pgadmin: Registering blueprint module: <pgadmin.browser.BrowserModule object at 0x7f5ef80b7ed0>
2018-12-05 17:45:02,105: INFO pgadmin: Examining potential module: pgadmin.browser.collection
2018-12-05 17:45:02,105: INFO pgadmin: Examining potential module: pgadmin.browser.register_browser_preferences
2018-12-05 17:45:02,105: INFO pgadmin: Examining potential module: pgadmin.browser.server_groups
2018-12-05 17:45:02,105: INFO pgadmin: Examining potential module: pgadmin.browser.tests
2018-12-05 17:45:02,106: INFO pgadmin: Examining potential module: pgadmin.browser.utils
2018-12-05 17:45:02,108: INFO pgadmin: Examining potential module: pgadmin.browser.server_groups.servers
2018-12-05 17:45:02,108: INFO pgadmin: Examining potential module: pgadmin.browser.server_groups.tests
2018-12-05 17:45:02,112: INFO pgadmin: Examining potential module: pgadmin.browser.server_groups.servers.databases
2018-12-05 17:45:02,112: INFO pgadmin: Examining potential module: pgadmin.browser.server_groups.servers.gpdb
2018-12-05 17:45:02,112: INFO pgadmin: Examining potential module: pgadmin.browser.server_groups.servers.pgagent
2018-12-05 17:45:02,116: INFO pgadmin: Examining potential module: pgadmin.browser.server_groups.servers.ppas
2018-12-05 17:45:02,117: INFO pgadmin: Examining potential module: pgadmin.browser.server_groups.servers.resource_groups
2018-12-05 17:45:02,120: INFO pgadmin: Examining potential module: pgadmin.browser.server_groups.servers.roles
2018-12-05 17:45:02,120: INFO pgadmin: Examining potential module: pgadmin.browser.server_groups.servers.tablespaces
2018-12-05 17:45:02,121: INFO pgadmin: Examining potential module: pgadmin.browser.server_groups.servers.tests
2018-12-05 17:45:02,121: INFO pgadmin: Examining potential module: pgadmin.browser.server_groups.servers.types
2018-12-05 17:45:02,121: INFO pgadmin: Examining potential module: pgadmin.browser.server_groups.servers.utils
2018-12-05 17:45:02,127: INFO pgadmin: Examining potential module: pgadmin.browser.server_groups.servers.databases.casts
2018-12-05 17:45:02,131: INFO pgadmin: Examining potential module: pgadmin.browser.server_groups.servers.databases.event_triggers
2018-12-05 17:45:02,135: INFO pgadmin: Examining potential module: pgadmin.browser.server_groups.servers.databases.extensions
2018-12-05 17:45:02,138: INFO pgadmin: Examining potential module: pgadmin.browser.server_groups.servers.databases.external_tables
2018-12-05 17:45:02,142: INFO pgadmin: Examining potential module: pgadmin.browser.server_groups.servers.databases.foreign_data_wrappers
2018-12-05 17:45:02,147: INFO pgadmin: Examining potential module: pgadmin.browser.server_groups.servers.databases.languages
2018-12-05 17:45:02,151: INFO pgadmin: Examining potential module: pgadmin.browser.server_groups.servers.databases.schemas
2018-12-05 17:45:02,151: INFO pgadmin: Examining potential module: pgadmin.browser.server_groups.servers.databases.tests
2018-12-05 17:45:02,151: INFO pgadmin: Examining potential module: pgadmin.browser.server_groups.servers.databases.utils
2018-12-05 17:45:02,160: INFO pgadmin: Examining potential module: pgadmin.browser.server_groups.servers.databases.casts.tests
2018-12-05 17:45:02,168: INFO pgadmin: Examining potential module: pgadmin.browser.server_groups.servers.databases.event_triggers.tests
2018-12-05 17:45:02,174: INFO pgadmin: Examining potential module: pgadmin.browser.server_groups.servers.databases.extensions.tests
2018-12-05 17:45:02,181: INFO pgadmin: Examining potential module: pgadmin.browser.server_groups.servers.databases.external_tables.actions
2018-12-05 17:45:02,181: INFO pgadmin: Examining potential module: pgadmin.browser.server_groups.servers.databases.external_tables.mapping_utils
2018-12-05 17:45:02,182: INFO pgadmin: Examining potential module: pgadmin.browser.server_groups.servers.databases.external_tables.properties
2018-12-05 17:45:02,182: INFO pgadmin: Examining potential module: pgadmin.browser.server_groups.servers.databases.external_tables.reverse_engineer_ddl
2018-12-05 17:45:02,182: INFO pgadmin: Examining potential module: pgadmin.browser.server_groups.servers.databases.external_tables.tests
2018-12-05 17:45:02,185: INFO pgadmin: Examining potential module: pgadmin.browser.server_groups.servers.databases.foreign_data_wrappers.foreign_servers
2018-12-05 17:45:02,190: INFO pgadmin: Examining potential module: pgadmin.browser.server_groups.servers.databases.foreign_data_wrappers.tests
2018-12-05 17:45:02,197: INFO pgadmin: Examining potential module: pgadmin.browser.server_groups.servers.databases.foreign_data_wrappers.foreign_servers.tests
2018-12-05 17:45:02,198: INFO pgadmin: Examining potential module: pgadmin.browser.server_groups.servers.databases.foreign_data_wrappers.foreign_servers.user_mapping
2018-12-05 17:45:02,209: INFO pgadmin: Examining potential module: pgadmin.browser.server_groups.servers.databases.foreign_data_wrappers.foreign_servers.user_mapping.tests
2018-12-05 17:45:02,217: INFO pgadmin: Examining potential module: pgadmin.browser.server_groups.servers.databases.languages.tests
2018-12-05 17:45:02,224: INFO pgadmin: Examining potential module: pgadmin.browser.server_groups.servers.databases.schemas.catalog_objects
2018-12-05 17:45:02,226: INFO pgadmin: Examining potential module: pgadmin.browser.server_groups.servers.databases.schemas.collations
2018-12-05 17:45:02,229: INFO pgadmin: Examining potential module: pgadmin.browser.server_groups.servers.databases.schemas.domains
2018-12-05 17:45:02,234: INFO pgadmin: Examining potential module: pgadmin.browser.server_groups.servers.databases.schemas.foreign_tables
2018-12-05 17:45:02,240: INFO pgadmin: Examining potential module: pgadmin.browser.server_groups.servers.databases.schemas.fts_configurations
2018-12-05 17:45:02,245: INFO pgadmin: Examining potential module: pgadmin.browser.server_groups.servers.databases.schemas.fts_dictionaries
2018-12-05 17:45:02,249: INFO pgadmin: Examining potential module: pgadmin.browser.server_groups.servers.databases.schemas.fts_parser
2018-12-05 17:45:02,253: INFO pgadmin: Examining potential module: pgadmin.browser.server_groups.servers.databases.schemas.fts_templates
2018-12-05 17:45:02,257: INFO pgadmin: Examining potential module: pgadmin.browser.server_groups.servers.databases.schemas.functions
2018-12-05 17:45:02,257: INFO pgadmin: Examining potential module: pgadmin.browser.server_groups.servers.databases.schemas.packages
2018-12-05 17:45:02,261: INFO pgadmin: Examining potential module: pgadmin.browser.server_groups.servers.databases.schemas.sequences
2018-12-05 17:45:02,266: INFO pgadmin: Examining potential module: pgadmin.browser.server_groups.servers.databases.schemas.synonyms
2018-12-05 17:45:02,269: INFO pgadmin: Examining potential module: pgadmin.browser.server_groups.servers.databases.schemas.tables
2018-12-05 17:45:02,289: INFO pgadmin: Examining potential module: pgadmin.browser.server_groups.servers.databases.schemas.tests
2018-12-05 17:45:02,289: INFO pgadmin: Examining potential module: pgadmin.browser.server_groups.servers.databases.schemas.types
2018-12-05 17:45:02,296: INFO pgadmin: Examining potential module: pgadmin.browser.server_groups.servers.databases.schemas.utils
2018-12-05 17:45:02,296: INFO pgadmin: Examining potential module: pgadmin.browser.server_groups.servers.databases.schemas.views
2018-12-05 17:45:02,311: INFO pgadmin: Examining potential module: pgadmin.browser.server_groups.servers.databases.schemas.catalog_objects.columns
2018-12-05 17:45:02,322: INFO pgadmin: Examining potential module: pgadmin.browser.server_groups.servers.databases.schemas.collations.tests
2018-12-05 17:45:02,330: INFO pgadmin: Examining potential module: pgadmin.browser.server_groups.servers.databases.schemas.domains.domain_constraints
2018-12-05 17:45:02,334: INFO pgadmin: Examining potential module: pgadmin.browser.server_groups.servers.databases.schemas.domains.tests
2018-12-05 17:45:02,350: INFO pgadmin: Examining potential module: pgadmin.browser.server_groups.servers.databases.schemas.foreign_tables.tests
2018-12-05 17:45:02,365: INFO pgadmin: Examining potential module: pgadmin.browser.server_groups.servers.databases.schemas.fts_configurations.tests
2018-12-05 17:45:02,376: INFO pgadmin: Examining potential module: pgadmin.browser.server_groups.servers.databases.schemas.fts_dictionaries.tests
2018-12-05 17:45:02,384: INFO pgadmin: Examining potential module: pgadmin.browser.server_groups.servers.databases.schemas.fts_parser.tests
2018-12-05 17:45:02,397: INFO pgadmin: Examining potential module: pgadmin.browser.server_groups.servers.databases.schemas.fts_templates.tests
2018-12-05 17:45:02,406: INFO pgadmin: Examining potential module: pgadmin.browser.server_groups.servers.databases.schemas.functions.tests
2018-12-05 17:45:02,417: INFO pgadmin: Examining potential module: pgadmin.browser.server_groups.servers.databases.schemas.functions.tests
2018-12-05 17:45:02,428: INFO pgadmin: Examining potential module: pgadmin.browser.server_groups.servers.databases.schemas.functions.tests
2018-12-05 17:45:02,439: INFO pgadmin: Examining potential module: pgadmin.browser.server_groups.servers.databases.schemas.packages.edbfuncs
2018-12-05 17:45:02,443: INFO pgadmin: Examining potential module: pgadmin.browser.server_groups.servers.databases.schemas.packages.edbvars
2018-12-05 17:45:02,445: INFO pgadmin: Examining potential module: pgadmin.browser.server_groups.servers.databases.schemas.packages.tests
2018-12-05 17:45:02,453: INFO pgadmin: Examining potential module: pgadmin.browser.server_groups.servers.databases.schemas.packages.edbfuncs.tests
2018-12-05 17:45:02,458: INFO pgadmin: Examining potential module: pgadmin.browser.server_groups.servers.databases.schemas.packages.edbfuncs.tests
2018-12-05 17:45:02,466: INFO pgadmin: Examining potential module: pgadmin.browser.server_groups.servers.databases.schemas.sequences.tests
2018-12-05 17:45:02,504: INFO pgadmin: Examining potential module: pgadmin.browser.server_groups.servers.databases.schemas.synonyms.tests
2018-12-05 17:45:02,513: INFO pgadmin: Examining potential module: pgadmin.browser.server_groups.servers.databases.schemas.tables.base_partition_table
2018-12-05 17:45:02,513: INFO pgadmin: Examining potential module: pgadmin.browser.server_groups.servers.databases.schemas.tables.column
2018-12-05 17:45:02,519: INFO pgadmin: Examining potential module: pgadmin.browser.server_groups.servers.databases.schemas.tables.constraints
2018-12-05 17:45:02,521: INFO pgadmin: Examining potential module: pgadmin.browser.server_groups.servers.databases.schemas.tables.indexes
2018-12-05 17:45:02,529: INFO pgadmin: Examining potential module: pgadmin.browser.server_groups.servers.databases.schemas.tables.partitions
2018-12-05 17:45:02,530: INFO pgadmin: Examining potential module: pgadmin.browser.server_groups.servers.databases.schemas.tables.rules
2018-12-05 17:45:02,533: INFO pgadmin: Examining potential module: pgadmin.browser.server_groups.servers.databases.schemas.tables.tests
2018-12-05 17:45:02,533: INFO pgadmin: Examining potential module: pgadmin.browser.server_groups.servers.databases.schemas.tables.triggers
2018-12-05 17:45:02,539: INFO pgadmin: Examining potential module: pgadmin.browser.server_groups.servers.databases.schemas.tables.utils
2018-12-05 17:45:02,558: INFO pgadmin: Examining potential module: pgadmin.browser.server_groups.servers.databases.schemas.tables.column.tests
2018-12-05 17:45:02,565: INFO pgadmin: Examining potential module: pgadmin.browser.server_groups.servers.databases.schemas.tables.constraints.check_constraint
2018-12-05 17:45:02,571: INFO pgadmin: Examining potential module: pgadmin.browser.server_groups.servers.databases.schemas.tables.constraints.exclusion_constraint
2018-12-05 17:45:02,577: INFO pgadmin: Examining potential module: pgadmin.browser.server_groups.servers.databases.schemas.tables.constraints.foreign_key
2018-12-05 17:45:02,583: INFO pgadmin: Examining potential module: pgadmin.browser.server_groups.servers.databases.schemas.tables.constraints.index_constraint
2018-12-05 17:45:02,591: INFO pgadmin: Examining potential module: pgadmin.browser.server_groups.servers.databases.schemas.tables.constraints.tests
2018-12-05 17:45:02,592: INFO pgadmin: Examining potential module: pgadmin.browser.server_groups.servers.databases.schemas.tables.constraints.type
2018-12-05 17:45:02,593: INFO pgadmin: Examining potential module: pgadmin.browser.server_groups.servers.databases.schemas.tables.constraints.check_constraint.tests
2018-12-05 17:45:02,633: INFO pgadmin: Examining potential module: pgadmin.browser.server_groups.servers.databases.schemas.tables.indexes.tests
2018-12-05 17:45:02,645: INFO pgadmin: Examining potential module: pgadmin.browser.server_groups.servers.databases.schemas.tables.partitions.tests
2018-12-05 17:45:02,645: INFO pgadmin: Examining potential module: pgadmin.browser.server_groups.servers.databases.schemas.tables.partitions.tests
2018-12-05 17:45:02,651: INFO pgadmin: Examining potential module: pgadmin.browser.server_groups.servers.databases.schemas.tables.rules.tests
2018-12-05 17:45:02,660: INFO pgadmin: Examining potential module: pgadmin.browser.server_groups.servers.databases.schemas.tables.triggers.tests
2018-12-05 17:45:02,669: INFO pgadmin: Examining potential module: pgadmin.browser.server_groups.servers.databases.schemas.types.tests
2018-12-05 17:45:02,683: INFO pgadmin: Examining potential module: pgadmin.browser.server_groups.servers.databases.schemas.views.children
2018-12-05 17:45:02,684: INFO pgadmin: Examining potential module: pgadmin.browser.server_groups.servers.databases.schemas.views.tests
2018-12-05 17:45:02,730: INFO pgadmin: Examining potential module: pgadmin.browser.server_groups.servers.databases.schemas.views.children
2018-12-05 17:45:02,731: INFO pgadmin: Examining potential module: pgadmin.browser.server_groups.servers.databases.schemas.views.tests
2018-12-05 17:45:02,777: INFO pgadmin: Examining potential module: pgadmin.browser.server_groups.servers.databases.schemas.catalog_objects
2018-12-05 17:45:02,777: INFO pgadmin: Examining potential module: pgadmin.browser.server_groups.servers.databases.schemas.collations
2018-12-05 17:45:02,777: INFO pgadmin: Examining potential module: pgadmin.browser.server_groups.servers.databases.schemas.domains
2018-12-05 17:45:02,778: INFO pgadmin: Examining potential module: pgadmin.browser.server_groups.servers.databases.schemas.foreign_tables
2018-12-05 17:45:02,778: INFO pgadmin: Examining potential module: pgadmin.browser.server_groups.servers.databases.schemas.fts_configurations
2018-12-05 17:45:02,778: INFO pgadmin: Examining potential module: pgadmin.browser.server_groups.servers.databases.schemas.fts_dictionaries
2018-12-05 17:45:02,778: INFO pgadmin: Examining potential module: pgadmin.browser.server_groups.servers.databases.schemas.fts_parser
2018-12-05 17:45:02,778: INFO pgadmin: Examining potential module: pgadmin.browser.server_groups.servers.databases.schemas.fts_templates
2018-12-05 17:45:02,779: INFO pgadmin: Examining potential module: pgadmin.browser.server_groups.servers.databases.schemas.functions
2018-12-05 17:45:02,779: INFO pgadmin: Examining potential module: pgadmin.browser.server_groups.servers.databases.schemas.packages
2018-12-05 17:45:02,779: INFO pgadmin: Examining potential module: pgadmin.browser.server_groups.servers.databases.schemas.sequences
2018-12-05 17:45:02,779: INFO pgadmin: Examining potential module: pgadmin.browser.server_groups.servers.databases.schemas.synonyms
2018-12-05 17:45:02,779: INFO pgadmin: Examining potential module: pgadmin.browser.server_groups.servers.databases.schemas.tables
2018-12-05 17:45:02,779: INFO pgadmin: Examining potential module: pgadmin.browser.server_groups.servers.databases.schemas.tests
2018-12-05 17:45:02,780: INFO pgadmin: Examining potential module: pgadmin.browser.server_groups.servers.databases.schemas.types
2018-12-05 17:45:02,780: INFO pgadmin: Examining potential module: pgadmin.browser.server_groups.servers.databases.schemas.utils
2018-12-05 17:45:02,780: INFO pgadmin: Examining potential module: pgadmin.browser.server_groups.servers.databases.schemas.views
2018-12-05 17:45:03,263: INFO pgadmin: Examining potential module: pgadmin.browser.server_groups.servers.pgagent.schedules
2018-12-05 17:45:03,266: INFO pgadmin: Examining potential module: pgadmin.browser.server_groups.servers.pgagent.steps
2018-12-05 17:45:03,270: INFO pgadmin: Examining potential module: pgadmin.browser.server_groups.servers.pgagent.tests
2018-12-05 17:45:03,281: INFO pgadmin: Examining potential module: pgadmin.browser.server_groups.servers.resource_groups.tests
2018-12-05 17:45:03,286: INFO pgadmin: Examining potential module: pgadmin.browser.server_groups.servers.roles.tests
2018-12-05 17:45:03,292: INFO pgadmin: Examining potential module: pgadmin.browser.server_groups.servers.tablespaces.tests
2018-12-05 17:45:03,298: INFO pgadmin: Examining potential module: pgadmin.dashboard
2018-12-05 17:45:03,301: INFO pgadmin: Registering blueprint module: <pgadmin.dashboard.DashboardModule object at 0x7f5ef2c03890>
2018-12-05 17:45:03,301: INFO pgadmin: Examining potential module: pgadmin.dashboard.tests
2018-12-05 17:45:03,310: INFO pgadmin: Examining potential module: pgadmin.feature_tests
2018-12-05 17:45:03,310: INFO pgadmin: Examining potential module: pgadmin.help
2018-12-05 17:45:03,311: INFO pgadmin: Registering blueprint module: <pgadmin.help.HelpModule object at 0x7f5ef2c61d50>
2018-12-05 17:45:03,311: INFO pgadmin: Examining potential module: pgadmin.misc
2018-12-05 17:45:03,312: INFO pgadmin: Registering blueprint module: <pgadmin.misc.MiscModule object at 0x7f5ef2c0b310>
2018-12-05 17:45:03,313: INFO pgadmin: Examining potential module: pgadmin.misc.bgprocess
2018-12-05 17:45:03,337: INFO pgadmin: Examining potential module: pgadmin.misc.depends
2018-12-05 17:45:03,338: INFO pgadmin: Examining potential module: pgadmin.misc.file_manager
2018-12-05 17:45:03,346: INFO pgadmin: Examining potential module: pgadmin.misc.sql
2018-12-05 17:45:03,346: INFO pgadmin: Examining potential module: pgadmin.misc.statistics
2018-12-05 17:45:03,348: INFO pgadmin: Examining potential module: pgadmin.misc.bgprocess.process_executor
2018-12-05 17:45:03,351: INFO pgadmin: Examining potential module: pgadmin.misc.bgprocess.processes
2018-12-05 17:45:03,356: INFO pgadmin: Examining potential module: pgadmin.model
2018-12-05 17:45:03,357: INFO pgadmin: Examining potential module: pgadmin.preferences
2018-12-05 17:45:03,358: INFO pgadmin: Registering blueprint module: <pgadmin.preferences.PreferencesModule object at 0x7f5ef2608e90>
2018-12-05 17:45:03,360: INFO pgadmin: Examining potential module: pgadmin.redirects
2018-12-05 17:45:03,360: INFO pgadmin: Registering blueprint module: <pgadmin.utils.PgAdminModule object at 0x7f5ef26194d0>
2018-12-05 17:45:03,361: INFO pgadmin: Examining potential module: pgadmin.settings
2018-12-05 17:45:03,361: INFO pgadmin: Registering blueprint module: <pgadmin.settings.SettingsModule object at 0x7f5ef80b7750>
2018-12-05 17:45:03,363: INFO pgadmin: Examining potential module: pgadmin.setup
2018-12-05 17:45:03,364: INFO pgadmin: Examining potential module: pgadmin.tools
2018-12-05 17:45:03,364: INFO pgadmin: Registering blueprint module: <pgadmin.tools.ToolsModule object at 0x7f5ef2619e50>
2018-12-05 17:45:03,365: INFO pgadmin: Examining potential module: pgadmin.tools.backup
2018-12-05 17:45:03,368: INFO pgadmin: Examining potential module: pgadmin.tools.datagrid
2018-12-05 17:45:03,433: INFO pgadmin: Examining potential module: pgadmin.tools.debugger
2018-12-05 17:45:03,442: INFO pgadmin: Examining potential module: pgadmin.tools.grant_wizard
2018-12-05 17:45:03,445: INFO pgadmin: Examining potential module: pgadmin.tools.import_export
2018-12-05 17:45:03,447: INFO pgadmin: Examining potential module: pgadmin.tools.maintenance
2018-12-05 17:45:03,449: INFO pgadmin: Examining potential module: pgadmin.tools.restore
2018-12-05 17:45:03,452: INFO pgadmin: Examining potential module: pgadmin.tools.sqleditor
2018-12-05 17:45:03,452: INFO pgadmin: Examining potential module: pgadmin.tools.user_management
2018-12-05 17:45:03,455: INFO pgadmin: Examining potential module: pgadmin.tools.backup.tests
2018-12-05 17:45:03,470: INFO pgadmin: Examining potential module: pgadmin.tools.import_export.tests
2018-12-05 17:45:03,472: INFO pgadmin: Examining potential module: pgadmin.tools.maintenance.tests
2018-12-05 17:45:03,473: INFO pgadmin: Examining potential module: pgadmin.tools.restore.tests
2018-12-05 17:45:03,475: INFO pgadmin: Examining potential module: pgadmin.tools.sqleditor.command
2018-12-05 17:45:03,475: INFO pgadmin: Examining potential module: pgadmin.tools.sqleditor.tests
2018-12-05 17:45:03,475: INFO pgadmin: Examining potential module: pgadmin.tools.sqleditor.utils
2018-12-05 17:45:03,483: INFO pgadmin: Examining potential module: pgadmin.utils
NOTE: Configuring authentication for DESKTOP mode.
pgAdmin 4 - Application Initialisation
======================================

Non-ASCII character '\xc5' in file <https://jenkins.pgadmin.org/job/pgadmin4-master-python27/ws/web/pgadmin/tools/sqleditor/tests/test_encoding_charset.py> on line 59, but no encoding declared; see http://python.org/dev/peps/pep-0263/ for details (test_encoding_charset.py, line 59)
ERROR: Error detected when running the Python tests.
ERROR: Error detected when running the Python tests.
Build step 'Execute shell' marked build as failure

Reply | Threaded
Open this post in threaded view
|

Re: Build failed in Jenkins: pgadmin4-master-python27 #825

Khushboo Vashi
Hi,

Please find the attached fix for this failure.

Thanks,
Khushboo



On Wed, Dec 5, 2018 at 9:45 AM pgAdmin 4 Jenkins <[hidden email]> wrote:
See <https://jenkins.pgadmin.org/job/pgadmin4-master-python27/825/display/redirect?page=changes>

Changes:

[Dave Page] Allow servers to be pre-loaded into container deployments. Fixes #3801

------------------------------------------
[...truncated 22.20 KB...]
Requirement already satisfied: testtools==2.3.0 in ./pgadmin-venv/lib/python2.7/site-packages (from -r web/regression/requirements.txt (line 12)) (2.3.0)
Requirement already satisfied: traceback2==1.4.0 in ./pgadmin-venv/lib/python2.7/site-packages (from -r web/regression/requirements.txt (line 13)) (1.4.0)
Requirement already satisfied: unittest2==1.1.0 in ./pgadmin-venv/lib/python2.7/site-packages (from -r web/regression/requirements.txt (line 14)) (1.1.0)
Collecting selenium==3.11.0 (from -r web/regression/requirements.txt (line 19))
  Using cached https://files.pythonhosted.org/packages/d4/28/8124d32415bd3d67fabea52480395427576b582771283e89ce10a56d9e5b/selenium-3.11.0.tar.gz
Collecting mock===2.0.0 (from -r web/regression/requirements.txt (line 29))
  Using cached https://files.pythonhosted.org/packages/0c/53/014354fc93c591ccc4abff12c473ad565a2eb24dcd82490fae33dbf2539f/mock-2.0.0.tar.gz
Collecting chromedriver_installer==0.0.6 (from -r web/regression/requirements.txt (line 33))
  Using cached https://files.pythonhosted.org/packages/c8/01/0a8a725bb605f68923aba16099a01cbbfe547c8b7dc96fd9a554424f6524/chromedriver_installer-0.0.6.tar.gz
Requirement already satisfied: itsdangerous>=0.21 in ./pgadmin-venv/lib/python2.7/site-packages (from Flask==0.12.4->-r web/regression/../../requirements.txt (line 9)) (1.1.0)
Requirement already satisfied: click>=2.0 in ./pgadmin-venv/lib/python2.7/site-packages (from Flask==0.12.4->-r web/regression/../../requirements.txt (line 9)) (7.0)
Requirement already satisfied: Werkzeug>=0.7 in ./pgadmin-venv/lib/python2.7/site-packages (from Flask==0.12.4->-r web/regression/../../requirements.txt (line 9)) (0.14.1)
Requirement already satisfied: Jinja2>=2.4 in ./pgadmin-venv/lib/python2.7/site-packages (from Flask==0.12.4->-r web/regression/../../requirements.txt (line 9)) (2.10)
Requirement already satisfied: alembic>=0.6 in ./pgadmin-venv/lib/python2.7/site-packages (from Flask-Migrate==2.1.1->-r web/regression/../../requirements.txt (line 13)) (1.0.5)
Requirement already satisfied: webencodings in ./pgadmin-venv/lib/python2.7/site-packages (from html5lib==1.0.1->-r web/regression/../../requirements.txt (line 17)) (0.5.1)
Requirement already satisfied: Flask-BabelEx>=0.9.3 in ./pgadmin-venv/lib/python2.7/site-packages (from Flask-Security>=3.0.0->-r web/regression/../../requirements.txt (line 41)) (0.9.3)
Requirement already satisfied: paramiko>=1.15.2 in ./pgadmin-venv/lib/python2.7/site-packages (from sshtunnel>=0.1.3->-r web/regression/../../requirements.txt (line 42)) (2.4.2)
Requirement already satisfied: argparse in ./pgadmin-venv/lib/python2.7/site-packages (from unittest2==1.1.0->-r web/regression/requirements.txt (line 14)) (1.4.0)
Collecting funcsigs>=1 (from mock===2.0.0->-r web/regression/requirements.txt (line 29))
  Using cached https://files.pythonhosted.org/packages/94/4a/db842e7a0545de1cdb0439bb80e6e42dfe82aaeaadd4072f2263a4fbed23/funcsigs-1.0.2.tar.gz
Requirement already satisfied: MarkupSafe>=0.23 in ./pgadmin-venv/lib/python2.7/site-packages (from Jinja2>=2.4->Flask==0.12.4->-r web/regression/../../requirements.txt (line 9)) (1.1.0)
Requirement already satisfied: python-editor>=0.3 in ./pgadmin-venv/lib/python2.7/site-packages (from alembic>=0.6->Flask-Migrate==2.1.1->-r web/regression/../../requirements.txt (line 13)) (1.0.3)
Requirement already satisfied: Mako in ./pgadmin-venv/lib/python2.7/site-packages (from alembic>=0.6->Flask-Migrate==2.1.1->-r web/regression/../../requirements.txt (line 13)) (1.0.7)
Requirement already satisfied: Babel>=1.0 in ./pgadmin-venv/lib/python2.7/site-packages (from Flask-BabelEx>=0.9.3->Flask-Security>=3.0.0->-r web/regression/../../requirements.txt (line 41)) (2.6.0)
Requirement already satisfied: pynacl>=1.0.1 in ./pgadmin-venv/lib/python2.7/site-packages (from paramiko>=1.15.2->sshtunnel>=0.1.3->-r web/regression/../../requirements.txt (line 42)) (1.3.0)
Requirement already satisfied: cryptography>=1.5 in ./pgadmin-venv/lib/python2.7/site-packages (from paramiko>=1.15.2->sshtunnel>=0.1.3->-r web/regression/../../requirements.txt (line 42)) (2.4.2)
Requirement already satisfied: bcrypt>=3.1.3 in ./pgadmin-venv/lib/python2.7/site-packages (from paramiko>=1.15.2->sshtunnel>=0.1.3->-r web/regression/../../requirements.txt (line 42)) (3.1.4)
Requirement already satisfied: pyasn1>=0.1.7 in ./pgadmin-venv/lib/python2.7/site-packages (from paramiko>=1.15.2->sshtunnel>=0.1.3->-r web/regression/../../requirements.txt (line 42)) (0.4.4)
Requirement already satisfied: cffi>=1.4.1 in ./pgadmin-venv/lib/python2.7/site-packages (from pynacl>=1.0.1->paramiko>=1.15.2->sshtunnel>=0.1.3->-r web/regression/../../requirements.txt (line 42)) (1.11.5)
Requirement already satisfied: idna>=2.1 in ./pgadmin-venv/lib/python2.7/site-packages (from cryptography>=1.5->paramiko>=1.15.2->sshtunnel>=0.1.3->-r web/regression/../../requirements.txt (line 42)) (2.8)
Requirement already satisfied: enum34; python_version < "3" in ./pgadmin-venv/lib/python2.7/site-packages (from cryptography>=1.5->paramiko>=1.15.2->sshtunnel>=0.1.3->-r web/regression/../../requirements.txt (line 42)) (1.1.6)
Requirement already satisfied: asn1crypto>=0.21.0 in ./pgadmin-venv/lib/python2.7/site-packages (from cryptography>=1.5->paramiko>=1.15.2->sshtunnel>=0.1.3->-r web/regression/../../requirements.txt (line 42)) (0.24.0)
Requirement already satisfied: ipaddress; python_version < "3" in ./pgadmin-venv/lib/python2.7/site-packages (from cryptography>=1.5->paramiko>=1.15.2->sshtunnel>=0.1.3->-r web/regression/../../requirements.txt (line 42)) (1.0.22)
Requirement already satisfied: pycparser in ./pgadmin-venv/lib/python2.7/site-packages (from cffi>=1.4.1->pynacl>=1.0.1->paramiko>=1.15.2->sshtunnel>=0.1.3->-r web/regression/../../requirements.txt (line 42)) (2.19)
Skipping bdist_wheel for pycodestyle, due to binaries being disabled for it.
Skipping bdist_wheel for pyperclip, due to binaries being disabled for it.
Skipping bdist_wheel for testscenarios, due to binaries being disabled for it.
Skipping bdist_wheel for selenium, due to binaries being disabled for it.
Skipping bdist_wheel for mock, due to binaries being disabled for it.
Skipping bdist_wheel for chromedriver-installer, due to binaries being disabled for it.
Skipping bdist_wheel for funcsigs, due to binaries being disabled for it.
Installing collected packages: pycodestyle, pyperclip, testscenarios, selenium, funcsigs, mock, chromedriver-installer
  Running setup.py install for pycodestyle: started
    Running setup.py install for pycodestyle: finished with status 'done'
  Running setup.py install for pyperclip: started
    Running setup.py install for pyperclip: finished with status 'done'
  Running setup.py install for testscenarios: started
    Running setup.py install for testscenarios: finished with status 'done'
  Running setup.py install for selenium: started
    Running setup.py install for selenium: finished with status 'done'
  Running setup.py install for funcsigs: started
    Running setup.py install for funcsigs: finished with status 'done'
  Running setup.py install for mock: started
    Running setup.py install for mock: finished with status 'done'
  Running setup.py install for chromedriver-installer: started
    Running setup.py install for chromedriver-installer: finished with status 'done'
Successfully installed chromedriver-installer-0.0.6 funcsigs-1.0.2 mock-2.0.0 pycodestyle-2.3.1 pyperclip-1.6.5 selenium-3.11.0 testscenarios-0.5.0
Running PEP-8 checks...

cd web && pycodestyle --config=.pycodestyle .
Running regression tests...

<https://jenkins.pgadmin.org/job/pgadmin4-master-python27/ws/pgadmin-venv/lib/python2.7/site-packages/psycopg2/__init__.py>:144: UserWarning: The psycopg2 wheel package will be renamed from release 2.8; in order to keep installing from binary please use "pip install psycopg2-binary" instead. For details see: <http://initd.org/psycopg/docs/install.html#binary-install-from-pypi>.
  """)
2018-12-05 17:45:01,564: INFO   pgadmin:        ########################################################
2018-12-05 17:45:01,564: INFO   pgadmin:        Starting pgAdmin 4 v3.6...
2018-12-05 17:45:01,564: INFO   pgadmin:        ########################################################
2018-12-05 17:45:01,564: DEBUG  pgadmin:        Python syspath: ['<https://jenkins.pgadmin.org/job/pgadmin4-master-python27/ws/web/regression',> '<https://jenkins.pgadmin.org/job/pgadmin4-master-python27/ws/web',> '<https://jenkins.pgadmin.org/job/pgadmin4-master-python27/ws/web/regression',> '<https://jenkins.pgadmin.org/job/pgadmin4-master-python27/ws/pgadmin-venv/lib/python27.zip',> '<https://jenkins.pgadmin.org/job/pgadmin4-master-python27/ws/pgadmin-venv/lib/python2.7',> '<https://jenkins.pgadmin.org/job/pgadmin4-master-python27/ws/pgadmin-venv/lib/python2.7/plat-linux2',> '<https://jenkins.pgadmin.org/job/pgadmin4-master-python27/ws/pgadmin-venv/lib/python2.7/lib-tk',> '<https://jenkins.pgadmin.org/job/pgadmin4-master-python27/ws/pgadmin-venv/lib/python2.7/lib-old',> '<https://jenkins.pgadmin.org/job/pgadmin4-master-python27/ws/pgadmin-venv/lib/python2.7/lib-dynload',> '/usr/local/python-2.7/lib/python2.7', '/usr/local/python-2.7/lib/python2.7/plat-linux2', '/usr/local/python-2.7/lib/python2.7/lib-tk', '<https://jenkins.pgadmin.org/job/pgadmin4-master-python27/ws/pgadmin-venv/lib/python2.7/site-packages']>
2018-12-05 17:45:01,565: DEBUG  pgadmin:        Available translations: [Locale('pl'), Locale('zh'), Locale('de'), Locale('ja'), Locale('ru'), Locale('fr'), Locale('ko'), Locale('es')]
2018-12-05 17:45:02,102: INFO   pgadmin:        Examining potential module: pgadmin.about
2018-12-05 17:45:02,103: INFO   pgadmin:        Registering blueprint module: <pgadmin.about.AboutModule object at 0x7f5ef3b5c210>
2018-12-05 17:45:02,104: INFO   pgadmin:        Examining potential module: pgadmin.browser
2018-12-05 17:45:02,104: INFO   pgadmin:        Registering blueprint module: <pgadmin.browser.BrowserModule object at 0x7f5ef80b7ed0>
2018-12-05 17:45:02,105: INFO   pgadmin:        Examining potential module: pgadmin.browser.collection
2018-12-05 17:45:02,105: INFO   pgadmin:        Examining potential module: pgadmin.browser.register_browser_preferences
2018-12-05 17:45:02,105: INFO   pgadmin:        Examining potential module: pgadmin.browser.server_groups
2018-12-05 17:45:02,105: INFO   pgadmin:        Examining potential module: pgadmin.browser.tests
2018-12-05 17:45:02,106: INFO   pgadmin:        Examining potential module: pgadmin.browser.utils
2018-12-05 17:45:02,108: INFO   pgadmin:        Examining potential module: pgadmin.browser.server_groups.servers
2018-12-05 17:45:02,108: INFO   pgadmin:        Examining potential module: pgadmin.browser.server_groups.tests
2018-12-05 17:45:02,112: INFO   pgadmin:        Examining potential module: pgadmin.browser.server_groups.servers.databases
2018-12-05 17:45:02,112: INFO   pgadmin:        Examining potential module: pgadmin.browser.server_groups.servers.gpdb
2018-12-05 17:45:02,112: INFO   pgadmin:        Examining potential module: pgadmin.browser.server_groups.servers.pgagent
2018-12-05 17:45:02,116: INFO   pgadmin:        Examining potential module: pgadmin.browser.server_groups.servers.ppas
2018-12-05 17:45:02,117: INFO   pgadmin:        Examining potential module: pgadmin.browser.server_groups.servers.resource_groups
2018-12-05 17:45:02,120: INFO   pgadmin:        Examining potential module: pgadmin.browser.server_groups.servers.roles
2018-12-05 17:45:02,120: INFO   pgadmin:        Examining potential module: pgadmin.browser.server_groups.servers.tablespaces
2018-12-05 17:45:02,121: INFO   pgadmin:        Examining potential module: pgadmin.browser.server_groups.servers.tests
2018-12-05 17:45:02,121: INFO   pgadmin:        Examining potential module: pgadmin.browser.server_groups.servers.types
2018-12-05 17:45:02,121: INFO   pgadmin:        Examining potential module: pgadmin.browser.server_groups.servers.utils
2018-12-05 17:45:02,127: INFO   pgadmin:        Examining potential module: pgadmin.browser.server_groups.servers.databases.casts
2018-12-05 17:45:02,131: INFO   pgadmin:        Examining potential module: pgadmin.browser.server_groups.servers.databases.event_triggers
2018-12-05 17:45:02,135: INFO   pgadmin:        Examining potential module: pgadmin.browser.server_groups.servers.databases.extensions
2018-12-05 17:45:02,138: INFO   pgadmin:        Examining potential module: pgadmin.browser.server_groups.servers.databases.external_tables
2018-12-05 17:45:02,142: INFO   pgadmin:        Examining potential module: pgadmin.browser.server_groups.servers.databases.foreign_data_wrappers
2018-12-05 17:45:02,147: INFO   pgadmin:        Examining potential module: pgadmin.browser.server_groups.servers.databases.languages
2018-12-05 17:45:02,151: INFO   pgadmin:        Examining potential module: pgadmin.browser.server_groups.servers.databases.schemas
2018-12-05 17:45:02,151: INFO   pgadmin:        Examining potential module: pgadmin.browser.server_groups.servers.databases.tests
2018-12-05 17:45:02,151: INFO   pgadmin:        Examining potential module: pgadmin.browser.server_groups.servers.databases.utils
2018-12-05 17:45:02,160: INFO   pgadmin:        Examining potential module: pgadmin.browser.server_groups.servers.databases.casts.tests
2018-12-05 17:45:02,168: INFO   pgadmin:        Examining potential module: pgadmin.browser.server_groups.servers.databases.event_triggers.tests
2018-12-05 17:45:02,174: INFO   pgadmin:        Examining potential module: pgadmin.browser.server_groups.servers.databases.extensions.tests
2018-12-05 17:45:02,181: INFO   pgadmin:        Examining potential module: pgadmin.browser.server_groups.servers.databases.external_tables.actions
2018-12-05 17:45:02,181: INFO   pgadmin:        Examining potential module: pgadmin.browser.server_groups.servers.databases.external_tables.mapping_utils
2018-12-05 17:45:02,182: INFO   pgadmin:        Examining potential module: pgadmin.browser.server_groups.servers.databases.external_tables.properties
2018-12-05 17:45:02,182: INFO   pgadmin:        Examining potential module: pgadmin.browser.server_groups.servers.databases.external_tables.reverse_engineer_ddl
2018-12-05 17:45:02,182: INFO   pgadmin:        Examining potential module: pgadmin.browser.server_groups.servers.databases.external_tables.tests
2018-12-05 17:45:02,185: INFO   pgadmin:        Examining potential module: pgadmin.browser.server_groups.servers.databases.foreign_data_wrappers.foreign_servers
2018-12-05 17:45:02,190: INFO   pgadmin:        Examining potential module: pgadmin.browser.server_groups.servers.databases.foreign_data_wrappers.tests
2018-12-05 17:45:02,197: INFO   pgadmin:        Examining potential module: pgadmin.browser.server_groups.servers.databases.foreign_data_wrappers.foreign_servers.tests
2018-12-05 17:45:02,198: INFO   pgadmin:        Examining potential module: pgadmin.browser.server_groups.servers.databases.foreign_data_wrappers.foreign_servers.user_mapping
2018-12-05 17:45:02,209: INFO   pgadmin:        Examining potential module: pgadmin.browser.server_groups.servers.databases.foreign_data_wrappers.foreign_servers.user_mapping.tests
2018-12-05 17:45:02,217: INFO   pgadmin:        Examining potential module: pgadmin.browser.server_groups.servers.databases.languages.tests
2018-12-05 17:45:02,224: INFO   pgadmin:        Examining potential module: pgadmin.browser.server_groups.servers.databases.schemas.catalog_objects
2018-12-05 17:45:02,226: INFO   pgadmin:        Examining potential module: pgadmin.browser.server_groups.servers.databases.schemas.collations
2018-12-05 17:45:02,229: INFO   pgadmin:        Examining potential module: pgadmin.browser.server_groups.servers.databases.schemas.domains
2018-12-05 17:45:02,234: INFO   pgadmin:        Examining potential module: pgadmin.browser.server_groups.servers.databases.schemas.foreign_tables
2018-12-05 17:45:02,240: INFO   pgadmin:        Examining potential module: pgadmin.browser.server_groups.servers.databases.schemas.fts_configurations
2018-12-05 17:45:02,245: INFO   pgadmin:        Examining potential module: pgadmin.browser.server_groups.servers.databases.schemas.fts_dictionaries
2018-12-05 17:45:02,249: INFO   pgadmin:        Examining potential module: pgadmin.browser.server_groups.servers.databases.schemas.fts_parser
2018-12-05 17:45:02,253: INFO   pgadmin:        Examining potential module: pgadmin.browser.server_groups.servers.databases.schemas.fts_templates
2018-12-05 17:45:02,257: INFO   pgadmin:        Examining potential module: pgadmin.browser.server_groups.servers.databases.schemas.functions
2018-12-05 17:45:02,257: INFO   pgadmin:        Examining potential module: pgadmin.browser.server_groups.servers.databases.schemas.packages
2018-12-05 17:45:02,261: INFO   pgadmin:        Examining potential module: pgadmin.browser.server_groups.servers.databases.schemas.sequences
2018-12-05 17:45:02,266: INFO   pgadmin:        Examining potential module: pgadmin.browser.server_groups.servers.databases.schemas.synonyms
2018-12-05 17:45:02,269: INFO   pgadmin:        Examining potential module: pgadmin.browser.server_groups.servers.databases.schemas.tables
2018-12-05 17:45:02,289: INFO   pgadmin:        Examining potential module: pgadmin.browser.server_groups.servers.databases.schemas.tests
2018-12-05 17:45:02,289: INFO   pgadmin:        Examining potential module: pgadmin.browser.server_groups.servers.databases.schemas.types
2018-12-05 17:45:02,296: INFO   pgadmin:        Examining potential module: pgadmin.browser.server_groups.servers.databases.schemas.utils
2018-12-05 17:45:02,296: INFO   pgadmin:        Examining potential module: pgadmin.browser.server_groups.servers.databases.schemas.views
2018-12-05 17:45:02,311: INFO   pgadmin:        Examining potential module: pgadmin.browser.server_groups.servers.databases.schemas.catalog_objects.columns
2018-12-05 17:45:02,322: INFO   pgadmin:        Examining potential module: pgadmin.browser.server_groups.servers.databases.schemas.collations.tests
2018-12-05 17:45:02,330: INFO   pgadmin:        Examining potential module: pgadmin.browser.server_groups.servers.databases.schemas.domains.domain_constraints
2018-12-05 17:45:02,334: INFO   pgadmin:        Examining potential module: pgadmin.browser.server_groups.servers.databases.schemas.domains.tests
2018-12-05 17:45:02,350: INFO   pgadmin:        Examining potential module: pgadmin.browser.server_groups.servers.databases.schemas.foreign_tables.tests
2018-12-05 17:45:02,365: INFO   pgadmin:        Examining potential module: pgadmin.browser.server_groups.servers.databases.schemas.fts_configurations.tests
2018-12-05 17:45:02,376: INFO   pgadmin:        Examining potential module: pgadmin.browser.server_groups.servers.databases.schemas.fts_dictionaries.tests
2018-12-05 17:45:02,384: INFO   pgadmin:        Examining potential module: pgadmin.browser.server_groups.servers.databases.schemas.fts_parser.tests
2018-12-05 17:45:02,397: INFO   pgadmin:        Examining potential module: pgadmin.browser.server_groups.servers.databases.schemas.fts_templates.tests
2018-12-05 17:45:02,406: INFO   pgadmin:        Examining potential module: pgadmin.browser.server_groups.servers.databases.schemas.functions.tests
2018-12-05 17:45:02,417: INFO   pgadmin:        Examining potential module: pgadmin.browser.server_groups.servers.databases.schemas.functions.tests
2018-12-05 17:45:02,428: INFO   pgadmin:        Examining potential module: pgadmin.browser.server_groups.servers.databases.schemas.functions.tests
2018-12-05 17:45:02,439: INFO   pgadmin:        Examining potential module: pgadmin.browser.server_groups.servers.databases.schemas.packages.edbfuncs
2018-12-05 17:45:02,443: INFO   pgadmin:        Examining potential module: pgadmin.browser.server_groups.servers.databases.schemas.packages.edbvars
2018-12-05 17:45:02,445: INFO   pgadmin:        Examining potential module: pgadmin.browser.server_groups.servers.databases.schemas.packages.tests
2018-12-05 17:45:02,453: INFO   pgadmin:        Examining potential module: pgadmin.browser.server_groups.servers.databases.schemas.packages.edbfuncs.tests
2018-12-05 17:45:02,458: INFO   pgadmin:        Examining potential module: pgadmin.browser.server_groups.servers.databases.schemas.packages.edbfuncs.tests
2018-12-05 17:45:02,466: INFO   pgadmin:        Examining potential module: pgadmin.browser.server_groups.servers.databases.schemas.sequences.tests
2018-12-05 17:45:02,504: INFO   pgadmin:        Examining potential module: pgadmin.browser.server_groups.servers.databases.schemas.synonyms.tests
2018-12-05 17:45:02,513: INFO   pgadmin:        Examining potential module: pgadmin.browser.server_groups.servers.databases.schemas.tables.base_partition_table
2018-12-05 17:45:02,513: INFO   pgadmin:        Examining potential module: pgadmin.browser.server_groups.servers.databases.schemas.tables.column
2018-12-05 17:45:02,519: INFO   pgadmin:        Examining potential module: pgadmin.browser.server_groups.servers.databases.schemas.tables.constraints
2018-12-05 17:45:02,521: INFO   pgadmin:        Examining potential module: pgadmin.browser.server_groups.servers.databases.schemas.tables.indexes
2018-12-05 17:45:02,529: INFO   pgadmin:        Examining potential module: pgadmin.browser.server_groups.servers.databases.schemas.tables.partitions
2018-12-05 17:45:02,530: INFO   pgadmin:        Examining potential module: pgadmin.browser.server_groups.servers.databases.schemas.tables.rules
2018-12-05 17:45:02,533: INFO   pgadmin:        Examining potential module: pgadmin.browser.server_groups.servers.databases.schemas.tables.tests
2018-12-05 17:45:02,533: INFO   pgadmin:        Examining potential module: pgadmin.browser.server_groups.servers.databases.schemas.tables.triggers
2018-12-05 17:45:02,539: INFO   pgadmin:        Examining potential module: pgadmin.browser.server_groups.servers.databases.schemas.tables.utils
2018-12-05 17:45:02,558: INFO   pgadmin:        Examining potential module: pgadmin.browser.server_groups.servers.databases.schemas.tables.column.tests
2018-12-05 17:45:02,565: INFO   pgadmin:        Examining potential module: pgadmin.browser.server_groups.servers.databases.schemas.tables.constraints.check_constraint
2018-12-05 17:45:02,571: INFO   pgadmin:        Examining potential module: pgadmin.browser.server_groups.servers.databases.schemas.tables.constraints.exclusion_constraint
2018-12-05 17:45:02,577: INFO   pgadmin:        Examining potential module: pgadmin.browser.server_groups.servers.databases.schemas.tables.constraints.foreign_key
2018-12-05 17:45:02,583: INFO   pgadmin:        Examining potential module: pgadmin.browser.server_groups.servers.databases.schemas.tables.constraints.index_constraint
2018-12-05 17:45:02,591: INFO   pgadmin:        Examining potential module: pgadmin.browser.server_groups.servers.databases.schemas.tables.constraints.tests
2018-12-05 17:45:02,592: INFO   pgadmin:        Examining potential module: pgadmin.browser.server_groups.servers.databases.schemas.tables.constraints.type
2018-12-05 17:45:02,593: INFO   pgadmin:        Examining potential module: pgadmin.browser.server_groups.servers.databases.schemas.tables.constraints.check_constraint.tests
2018-12-05 17:45:02,633: INFO   pgadmin:        Examining potential module: pgadmin.browser.server_groups.servers.databases.schemas.tables.indexes.tests
2018-12-05 17:45:02,645: INFO   pgadmin:        Examining potential module: pgadmin.browser.server_groups.servers.databases.schemas.tables.partitions.tests
2018-12-05 17:45:02,645: INFO   pgadmin:        Examining potential module: pgadmin.browser.server_groups.servers.databases.schemas.tables.partitions.tests
2018-12-05 17:45:02,651: INFO   pgadmin:        Examining potential module: pgadmin.browser.server_groups.servers.databases.schemas.tables.rules.tests
2018-12-05 17:45:02,660: INFO   pgadmin:        Examining potential module: pgadmin.browser.server_groups.servers.databases.schemas.tables.triggers.tests
2018-12-05 17:45:02,669: INFO   pgadmin:        Examining potential module: pgadmin.browser.server_groups.servers.databases.schemas.types.tests
2018-12-05 17:45:02,683: INFO   pgadmin:        Examining potential module: pgadmin.browser.server_groups.servers.databases.schemas.views.children
2018-12-05 17:45:02,684: INFO   pgadmin:        Examining potential module: pgadmin.browser.server_groups.servers.databases.schemas.views.tests
2018-12-05 17:45:02,730: INFO   pgadmin:        Examining potential module: pgadmin.browser.server_groups.servers.databases.schemas.views.children
2018-12-05 17:45:02,731: INFO   pgadmin:        Examining potential module: pgadmin.browser.server_groups.servers.databases.schemas.views.tests
2018-12-05 17:45:02,777: INFO   pgadmin:        Examining potential module: pgadmin.browser.server_groups.servers.databases.schemas.catalog_objects
2018-12-05 17:45:02,777: INFO   pgadmin:        Examining potential module: pgadmin.browser.server_groups.servers.databases.schemas.collations
2018-12-05 17:45:02,777: INFO   pgadmin:        Examining potential module: pgadmin.browser.server_groups.servers.databases.schemas.domains
2018-12-05 17:45:02,778: INFO   pgadmin:        Examining potential module: pgadmin.browser.server_groups.servers.databases.schemas.foreign_tables
2018-12-05 17:45:02,778: INFO   pgadmin:        Examining potential module: pgadmin.browser.server_groups.servers.databases.schemas.fts_configurations
2018-12-05 17:45:02,778: INFO   pgadmin:        Examining potential module: pgadmin.browser.server_groups.servers.databases.schemas.fts_dictionaries
2018-12-05 17:45:02,778: INFO   pgadmin:        Examining potential module: pgadmin.browser.server_groups.servers.databases.schemas.fts_parser
2018-12-05 17:45:02,778: INFO   pgadmin:        Examining potential module: pgadmin.browser.server_groups.servers.databases.schemas.fts_templates
2018-12-05 17:45:02,779: INFO   pgadmin:        Examining potential module: pgadmin.browser.server_groups.servers.databases.schemas.functions
2018-12-05 17:45:02,779: INFO   pgadmin:        Examining potential module: pgadmin.browser.server_groups.servers.databases.schemas.packages
2018-12-05 17:45:02,779: INFO   pgadmin:        Examining potential module: pgadmin.browser.server_groups.servers.databases.schemas.sequences
2018-12-05 17:45:02,779: INFO   pgadmin:        Examining potential module: pgadmin.browser.server_groups.servers.databases.schemas.synonyms
2018-12-05 17:45:02,779: INFO   pgadmin:        Examining potential module: pgadmin.browser.server_groups.servers.databases.schemas.tables
2018-12-05 17:45:02,779: INFO   pgadmin:        Examining potential module: pgadmin.browser.server_groups.servers.databases.schemas.tests
2018-12-05 17:45:02,780: INFO   pgadmin:        Examining potential module: pgadmin.browser.server_groups.servers.databases.schemas.types
2018-12-05 17:45:02,780: INFO   pgadmin:        Examining potential module: pgadmin.browser.server_groups.servers.databases.schemas.utils
2018-12-05 17:45:02,780: INFO   pgadmin:        Examining potential module: pgadmin.browser.server_groups.servers.databases.schemas.views
2018-12-05 17:45:03,263: INFO   pgadmin:        Examining potential module: pgadmin.browser.server_groups.servers.pgagent.schedules
2018-12-05 17:45:03,266: INFO   pgadmin:        Examining potential module: pgadmin.browser.server_groups.servers.pgagent.steps
2018-12-05 17:45:03,270: INFO   pgadmin:        Examining potential module: pgadmin.browser.server_groups.servers.pgagent.tests
2018-12-05 17:45:03,281: INFO   pgadmin:        Examining potential module: pgadmin.browser.server_groups.servers.resource_groups.tests
2018-12-05 17:45:03,286: INFO   pgadmin:        Examining potential module: pgadmin.browser.server_groups.servers.roles.tests
2018-12-05 17:45:03,292: INFO   pgadmin:        Examining potential module: pgadmin.browser.server_groups.servers.tablespaces.tests
2018-12-05 17:45:03,298: INFO   pgadmin:        Examining potential module: pgadmin.dashboard
2018-12-05 17:45:03,301: INFO   pgadmin:        Registering blueprint module: <pgadmin.dashboard.DashboardModule object at 0x7f5ef2c03890>
2018-12-05 17:45:03,301: INFO   pgadmin:        Examining potential module: pgadmin.dashboard.tests
2018-12-05 17:45:03,310: INFO   pgadmin:        Examining potential module: pgadmin.feature_tests
2018-12-05 17:45:03,310: INFO   pgadmin:        Examining potential module: pgadmin.help
2018-12-05 17:45:03,311: INFO   pgadmin:        Registering blueprint module: <pgadmin.help.HelpModule object at 0x7f5ef2c61d50>
2018-12-05 17:45:03,311: INFO   pgadmin:        Examining potential module: pgadmin.misc
2018-12-05 17:45:03,312: INFO   pgadmin:        Registering blueprint module: <pgadmin.misc.MiscModule object at 0x7f5ef2c0b310>
2018-12-05 17:45:03,313: INFO   pgadmin:        Examining potential module: pgadmin.misc.bgprocess
2018-12-05 17:45:03,337: INFO   pgadmin:        Examining potential module: pgadmin.misc.depends
2018-12-05 17:45:03,338: INFO   pgadmin:        Examining potential module: pgadmin.misc.file_manager
2018-12-05 17:45:03,346: INFO   pgadmin:        Examining potential module: pgadmin.misc.sql
2018-12-05 17:45:03,346: INFO   pgadmin:        Examining potential module: pgadmin.misc.statistics
2018-12-05 17:45:03,348: INFO   pgadmin:        Examining potential module: pgadmin.misc.bgprocess.process_executor
2018-12-05 17:45:03,351: INFO   pgadmin:        Examining potential module: pgadmin.misc.bgprocess.processes
2018-12-05 17:45:03,356: INFO   pgadmin:        Examining potential module: pgadmin.model
2018-12-05 17:45:03,357: INFO   pgadmin:        Examining potential module: pgadmin.preferences
2018-12-05 17:45:03,358: INFO   pgadmin:        Registering blueprint module: <pgadmin.preferences.PreferencesModule object at 0x7f5ef2608e90>
2018-12-05 17:45:03,360: INFO   pgadmin:        Examining potential module: pgadmin.redirects
2018-12-05 17:45:03,360: INFO   pgadmin:        Registering blueprint module: <pgadmin.utils.PgAdminModule object at 0x7f5ef26194d0>
2018-12-05 17:45:03,361: INFO   pgadmin:        Examining potential module: pgadmin.settings
2018-12-05 17:45:03,361: INFO   pgadmin:        Registering blueprint module: <pgadmin.settings.SettingsModule object at 0x7f5ef80b7750>
2018-12-05 17:45:03,363: INFO   pgadmin:        Examining potential module: pgadmin.setup
2018-12-05 17:45:03,364: INFO   pgadmin:        Examining potential module: pgadmin.tools
2018-12-05 17:45:03,364: INFO   pgadmin:        Registering blueprint module: <pgadmin.tools.ToolsModule object at 0x7f5ef2619e50>
2018-12-05 17:45:03,365: INFO   pgadmin:        Examining potential module: pgadmin.tools.backup
2018-12-05 17:45:03,368: INFO   pgadmin:        Examining potential module: pgadmin.tools.datagrid
2018-12-05 17:45:03,433: INFO   pgadmin:        Examining potential module: pgadmin.tools.debugger
2018-12-05 17:45:03,442: INFO   pgadmin:        Examining potential module: pgadmin.tools.grant_wizard
2018-12-05 17:45:03,445: INFO   pgadmin:        Examining potential module: pgadmin.tools.import_export
2018-12-05 17:45:03,447: INFO   pgadmin:        Examining potential module: pgadmin.tools.maintenance
2018-12-05 17:45:03,449: INFO   pgadmin:        Examining potential module: pgadmin.tools.restore
2018-12-05 17:45:03,452: INFO   pgadmin:        Examining potential module: pgadmin.tools.sqleditor
2018-12-05 17:45:03,452: INFO   pgadmin:        Examining potential module: pgadmin.tools.user_management
2018-12-05 17:45:03,455: INFO   pgadmin:        Examining potential module: pgadmin.tools.backup.tests
2018-12-05 17:45:03,470: INFO   pgadmin:        Examining potential module: pgadmin.tools.import_export.tests
2018-12-05 17:45:03,472: INFO   pgadmin:        Examining potential module: pgadmin.tools.maintenance.tests
2018-12-05 17:45:03,473: INFO   pgadmin:        Examining potential module: pgadmin.tools.restore.tests
2018-12-05 17:45:03,475: INFO   pgadmin:        Examining potential module: pgadmin.tools.sqleditor.command
2018-12-05 17:45:03,475: INFO   pgadmin:        Examining potential module: pgadmin.tools.sqleditor.tests
2018-12-05 17:45:03,475: INFO   pgadmin:        Examining potential module: pgadmin.tools.sqleditor.utils
2018-12-05 17:45:03,483: INFO   pgadmin:        Examining potential module: pgadmin.utils
NOTE: Configuring authentication for DESKTOP mode.
pgAdmin 4 - Application Initialisation
======================================

Non-ASCII character '\xc5' in file <https://jenkins.pgadmin.org/job/pgadmin4-master-python27/ws/web/pgadmin/tools/sqleditor/tests/test_encoding_charset.py> on line 59, but no encoding declared; see http://python.org/dev/peps/pep-0263/ for details (test_encoding_charset.py, line 59)
ERROR: Error detected when running the Python tests.
ERROR: Error detected when running the Python tests.
Build step 'Execute shell' marked build as failure


encoding_testcase_fix.patch (610 bytes) Download Attachment
Reply | Threaded
Open this post in threaded view
|

Build failed in Jenkins: pgadmin4-master-python27 #826

pgAdmin 4 Jenkins
In reply to this post by pgAdmin 4 Jenkins
See <https://jenkins.pgadmin.org/job/pgadmin4-master-python27/826/display/redirect?page=changes>

Changes:

[Dave Page] Ensure the browser toolbar buttons work in languages other than English.

[Dave Page] Remove blank messages from the Qt project file as they don't work on

------------------------------------------
[...truncated 22.32 KB...]
Requirement already satisfied: testtools==2.3.0 in ./pgadmin-venv/lib/python2.7/site-packages (from -r web/regression/requirements.txt (line 12)) (2.3.0)
Requirement already satisfied: traceback2==1.4.0 in ./pgadmin-venv/lib/python2.7/site-packages (from -r web/regression/requirements.txt (line 13)) (1.4.0)
Requirement already satisfied: unittest2==1.1.0 in ./pgadmin-venv/lib/python2.7/site-packages (from -r web/regression/requirements.txt (line 14)) (1.1.0)
Collecting selenium==3.11.0 (from -r web/regression/requirements.txt (line 19))
  Using cached https://files.pythonhosted.org/packages/d4/28/8124d32415bd3d67fabea52480395427576b582771283e89ce10a56d9e5b/selenium-3.11.0.tar.gz
Collecting mock===2.0.0 (from -r web/regression/requirements.txt (line 29))
  Using cached https://files.pythonhosted.org/packages/0c/53/014354fc93c591ccc4abff12c473ad565a2eb24dcd82490fae33dbf2539f/mock-2.0.0.tar.gz
Collecting chromedriver_installer==0.0.6 (from -r web/regression/requirements.txt (line 33))
  Using cached https://files.pythonhosted.org/packages/c8/01/0a8a725bb605f68923aba16099a01cbbfe547c8b7dc96fd9a554424f6524/chromedriver_installer-0.0.6.tar.gz
Requirement already satisfied: itsdangerous>=0.21 in ./pgadmin-venv/lib/python2.7/site-packages (from Flask==0.12.4->-r web/regression/../../requirements.txt (line 9)) (1.1.0)
Requirement already satisfied: click>=2.0 in ./pgadmin-venv/lib/python2.7/site-packages (from Flask==0.12.4->-r web/regression/../../requirements.txt (line 9)) (7.0)
Requirement already satisfied: Werkzeug>=0.7 in ./pgadmin-venv/lib/python2.7/site-packages (from Flask==0.12.4->-r web/regression/../../requirements.txt (line 9)) (0.14.1)
Requirement already satisfied: Jinja2>=2.4 in ./pgadmin-venv/lib/python2.7/site-packages (from Flask==0.12.4->-r web/regression/../../requirements.txt (line 9)) (2.10)
Requirement already satisfied: alembic>=0.6 in ./pgadmin-venv/lib/python2.7/site-packages (from Flask-Migrate==2.1.1->-r web/regression/../../requirements.txt (line 13)) (1.0.5)
Requirement already satisfied: webencodings in ./pgadmin-venv/lib/python2.7/site-packages (from html5lib==1.0.1->-r web/regression/../../requirements.txt (line 17)) (0.5.1)
Requirement already satisfied: Flask-BabelEx>=0.9.3 in ./pgadmin-venv/lib/python2.7/site-packages (from Flask-Security>=3.0.0->-r web/regression/../../requirements.txt (line 41)) (0.9.3)
Requirement already satisfied: paramiko>=1.15.2 in ./pgadmin-venv/lib/python2.7/site-packages (from sshtunnel>=0.1.3->-r web/regression/../../requirements.txt (line 42)) (2.4.2)
Requirement already satisfied: argparse in ./pgadmin-venv/lib/python2.7/site-packages (from unittest2==1.1.0->-r web/regression/requirements.txt (line 14)) (1.4.0)
Collecting funcsigs>=1 (from mock===2.0.0->-r web/regression/requirements.txt (line 29))
  Using cached https://files.pythonhosted.org/packages/94/4a/db842e7a0545de1cdb0439bb80e6e42dfe82aaeaadd4072f2263a4fbed23/funcsigs-1.0.2.tar.gz
Requirement already satisfied: MarkupSafe>=0.23 in ./pgadmin-venv/lib/python2.7/site-packages (from Jinja2>=2.4->Flask==0.12.4->-r web/regression/../../requirements.txt (line 9)) (1.1.0)
Requirement already satisfied: python-editor>=0.3 in ./pgadmin-venv/lib/python2.7/site-packages (from alembic>=0.6->Flask-Migrate==2.1.1->-r web/regression/../../requirements.txt (line 13)) (1.0.3)
Requirement already satisfied: Mako in ./pgadmin-venv/lib/python2.7/site-packages (from alembic>=0.6->Flask-Migrate==2.1.1->-r web/regression/../../requirements.txt (line 13)) (1.0.7)
Requirement already satisfied: Babel>=1.0 in ./pgadmin-venv/lib/python2.7/site-packages (from Flask-BabelEx>=0.9.3->Flask-Security>=3.0.0->-r web/regression/../../requirements.txt (line 41)) (2.6.0)
Requirement already satisfied: pynacl>=1.0.1 in ./pgadmin-venv/lib/python2.7/site-packages (from paramiko>=1.15.2->sshtunnel>=0.1.3->-r web/regression/../../requirements.txt (line 42)) (1.3.0)
Requirement already satisfied: cryptography>=1.5 in ./pgadmin-venv/lib/python2.7/site-packages (from paramiko>=1.15.2->sshtunnel>=0.1.3->-r web/regression/../../requirements.txt (line 42)) (2.4.2)
Requirement already satisfied: bcrypt>=3.1.3 in ./pgadmin-venv/lib/python2.7/site-packages (from paramiko>=1.15.2->sshtunnel>=0.1.3->-r web/regression/../../requirements.txt (line 42)) (3.1.4)
Requirement already satisfied: pyasn1>=0.1.7 in ./pgadmin-venv/lib/python2.7/site-packages (from paramiko>=1.15.2->sshtunnel>=0.1.3->-r web/regression/../../requirements.txt (line 42)) (0.4.4)
Requirement already satisfied: cffi>=1.4.1 in ./pgadmin-venv/lib/python2.7/site-packages (from pynacl>=1.0.1->paramiko>=1.15.2->sshtunnel>=0.1.3->-r web/regression/../../requirements.txt (line 42)) (1.11.5)
Requirement already satisfied: idna>=2.1 in ./pgadmin-venv/lib/python2.7/site-packages (from cryptography>=1.5->paramiko>=1.15.2->sshtunnel>=0.1.3->-r web/regression/../../requirements.txt (line 42)) (2.8)
Requirement already satisfied: enum34; python_version < "3" in ./pgadmin-venv/lib/python2.7/site-packages (from cryptography>=1.5->paramiko>=1.15.2->sshtunnel>=0.1.3->-r web/regression/../../requirements.txt (line 42)) (1.1.6)
Requirement already satisfied: asn1crypto>=0.21.0 in ./pgadmin-venv/lib/python2.7/site-packages (from cryptography>=1.5->paramiko>=1.15.2->sshtunnel>=0.1.3->-r web/regression/../../requirements.txt (line 42)) (0.24.0)
Requirement already satisfied: ipaddress; python_version < "3" in ./pgadmin-venv/lib/python2.7/site-packages (from cryptography>=1.5->paramiko>=1.15.2->sshtunnel>=0.1.3->-r web/regression/../../requirements.txt (line 42)) (1.0.22)
Requirement already satisfied: pycparser in ./pgadmin-venv/lib/python2.7/site-packages (from cffi>=1.4.1->pynacl>=1.0.1->paramiko>=1.15.2->sshtunnel>=0.1.3->-r web/regression/../../requirements.txt (line 42)) (2.19)
Skipping bdist_wheel for pycodestyle, due to binaries being disabled for it.
Skipping bdist_wheel for pyperclip, due to binaries being disabled for it.
Skipping bdist_wheel for testscenarios, due to binaries being disabled for it.
Skipping bdist_wheel for selenium, due to binaries being disabled for it.
Skipping bdist_wheel for mock, due to binaries being disabled for it.
Skipping bdist_wheel for chromedriver-installer, due to binaries being disabled for it.
Skipping bdist_wheel for funcsigs, due to binaries being disabled for it.
Installing collected packages: pycodestyle, pyperclip, testscenarios, selenium, funcsigs, mock, chromedriver-installer
  Running setup.py install for pycodestyle: started
    Running setup.py install for pycodestyle: finished with status 'done'
  Running setup.py install for pyperclip: started
    Running setup.py install for pyperclip: finished with status 'done'
  Running setup.py install for testscenarios: started
    Running setup.py install for testscenarios: finished with status 'done'
  Running setup.py install for selenium: started
    Running setup.py install for selenium: finished with status 'done'
  Running setup.py install for funcsigs: started
    Running setup.py install for funcsigs: finished with status 'done'
  Running setup.py install for mock: started
    Running setup.py install for mock: finished with status 'done'
  Running setup.py install for chromedriver-installer: started
    Running setup.py install for chromedriver-installer: finished with status 'done'
Successfully installed chromedriver-installer-0.0.6 funcsigs-1.0.2 mock-2.0.0 pycodestyle-2.3.1 pyperclip-1.6.5 selenium-3.11.0 testscenarios-0.5.0
Running PEP-8 checks...

cd web && pycodestyle --config=.pycodestyle .
Running regression tests...

<https://jenkins.pgadmin.org/job/pgadmin4-master-python27/ws/pgadmin-venv/lib/python2.7/site-packages/psycopg2/__init__.py>:144: UserWarning: The psycopg2 wheel package will be renamed from release 2.8; in order to keep installing from binary please use "pip install psycopg2-binary" instead. For details see: <http://initd.org/psycopg/docs/install.html#binary-install-from-pypi>.
  """)
2018-12-06 10:07:40,983: INFO pgadmin: ########################################################
2018-12-06 10:07:40,983: INFO pgadmin: Starting pgAdmin 4 v3.6...
2018-12-06 10:07:40,983: INFO pgadmin: ########################################################
2018-12-06 10:07:40,983: DEBUG pgadmin: Python syspath: ['<https://jenkins.pgadmin.org/job/pgadmin4-master-python27/ws/web/regression',> '<https://jenkins.pgadmin.org/job/pgadmin4-master-python27/ws/web',> '<https://jenkins.pgadmin.org/job/pgadmin4-master-python27/ws/web/regression',> '<https://jenkins.pgadmin.org/job/pgadmin4-master-python27/ws/pgadmin-venv/lib/python27.zip',> '<https://jenkins.pgadmin.org/job/pgadmin4-master-python27/ws/pgadmin-venv/lib/python2.7',> '<https://jenkins.pgadmin.org/job/pgadmin4-master-python27/ws/pgadmin-venv/lib/python2.7/plat-linux2',> '<https://jenkins.pgadmin.org/job/pgadmin4-master-python27/ws/pgadmin-venv/lib/python2.7/lib-tk',> '<https://jenkins.pgadmin.org/job/pgadmin4-master-python27/ws/pgadmin-venv/lib/python2.7/lib-old',> '<https://jenkins.pgadmin.org/job/pgadmin4-master-python27/ws/pgadmin-venv/lib/python2.7/lib-dynload',> '/usr/local/python-2.7/lib/python2.7', '/usr/local/python-2.7/lib/python2.7/plat-linux2', '/usr/local/python-2.7/lib/python2.7/lib-tk', '<https://jenkins.pgadmin.org/job/pgadmin4-master-python27/ws/pgadmin-venv/lib/python2.7/site-packages']>
2018-12-06 10:07:40,984: DEBUG pgadmin: Available translations: [Locale('pl'), Locale('zh'), Locale('de'), Locale('ja'), Locale('ru'), Locale('fr'), Locale('ko'), Locale('es')]
2018-12-06 10:07:41,501: INFO pgadmin: Examining potential module: pgadmin.about
2018-12-06 10:07:41,502: INFO pgadmin: Registering blueprint module: <pgadmin.about.AboutModule object at 0x7f2f76b4e210>
2018-12-06 10:07:41,503: INFO pgadmin: Examining potential module: pgadmin.browser
2018-12-06 10:07:41,503: INFO pgadmin: Registering blueprint module: <pgadmin.browser.BrowserModule object at 0x7f2f7b0a9ed0>
2018-12-06 10:07:41,503: INFO pgadmin: Examining potential module: pgadmin.browser.collection
2018-12-06 10:07:41,503: INFO pgadmin: Examining potential module: pgadmin.browser.register_browser_preferences
2018-12-06 10:07:41,504: INFO pgadmin: Examining potential module: pgadmin.browser.server_groups
2018-12-06 10:07:41,504: INFO pgadmin: Examining potential module: pgadmin.browser.tests
2018-12-06 10:07:41,504: INFO pgadmin: Examining potential module: pgadmin.browser.utils
2018-12-06 10:07:41,506: INFO pgadmin: Examining potential module: pgadmin.browser.server_groups.servers
2018-12-06 10:07:41,507: INFO pgadmin: Examining potential module: pgadmin.browser.server_groups.tests
2018-12-06 10:07:41,510: INFO pgadmin: Examining potential module: pgadmin.browser.server_groups.servers.databases
2018-12-06 10:07:41,510: INFO pgadmin: Examining potential module: pgadmin.browser.server_groups.servers.gpdb
2018-12-06 10:07:41,511: INFO pgadmin: Examining potential module: pgadmin.browser.server_groups.servers.pgagent
2018-12-06 10:07:41,515: INFO pgadmin: Examining potential module: pgadmin.browser.server_groups.servers.ppas
2018-12-06 10:07:41,515: INFO pgadmin: Examining potential module: pgadmin.browser.server_groups.servers.resource_groups
2018-12-06 10:07:41,519: INFO pgadmin: Examining potential module: pgadmin.browser.server_groups.servers.roles
2018-12-06 10:07:41,519: INFO pgadmin: Examining potential module: pgadmin.browser.server_groups.servers.tablespaces
2018-12-06 10:07:41,519: INFO pgadmin: Examining potential module: pgadmin.browser.server_groups.servers.tests
2018-12-06 10:07:41,520: INFO pgadmin: Examining potential module: pgadmin.browser.server_groups.servers.types
2018-12-06 10:07:41,520: INFO pgadmin: Examining potential module: pgadmin.browser.server_groups.servers.utils
2018-12-06 10:07:41,526: INFO pgadmin: Examining potential module: pgadmin.browser.server_groups.servers.databases.casts
2018-12-06 10:07:41,530: INFO pgadmin: Examining potential module: pgadmin.browser.server_groups.servers.databases.event_triggers
2018-12-06 10:07:41,533: INFO pgadmin: Examining potential module: pgadmin.browser.server_groups.servers.databases.extensions
2018-12-06 10:07:41,536: INFO pgadmin: Examining potential module: pgadmin.browser.server_groups.servers.databases.external_tables
2018-12-06 10:07:41,541: INFO pgadmin: Examining potential module: pgadmin.browser.server_groups.servers.databases.foreign_data_wrappers
2018-12-06 10:07:41,545: INFO pgadmin: Examining potential module: pgadmin.browser.server_groups.servers.databases.languages
2018-12-06 10:07:41,549: INFO pgadmin: Examining potential module: pgadmin.browser.server_groups.servers.databases.schemas
2018-12-06 10:07:41,549: INFO pgadmin: Examining potential module: pgadmin.browser.server_groups.servers.databases.tests
2018-12-06 10:07:41,550: INFO pgadmin: Examining potential module: pgadmin.browser.server_groups.servers.databases.utils
2018-12-06 10:07:41,558: INFO pgadmin: Examining potential module: pgadmin.browser.server_groups.servers.databases.casts.tests
2018-12-06 10:07:41,566: INFO pgadmin: Examining potential module: pgadmin.browser.server_groups.servers.databases.event_triggers.tests
2018-12-06 10:07:41,572: INFO pgadmin: Examining potential module: pgadmin.browser.server_groups.servers.databases.extensions.tests
2018-12-06 10:07:41,579: INFO pgadmin: Examining potential module: pgadmin.browser.server_groups.servers.databases.external_tables.actions
2018-12-06 10:07:41,580: INFO pgadmin: Examining potential module: pgadmin.browser.server_groups.servers.databases.external_tables.mapping_utils
2018-12-06 10:07:41,580: INFO pgadmin: Examining potential module: pgadmin.browser.server_groups.servers.databases.external_tables.properties
2018-12-06 10:07:41,580: INFO pgadmin: Examining potential module: pgadmin.browser.server_groups.servers.databases.external_tables.reverse_engineer_ddl
2018-12-06 10:07:41,580: INFO pgadmin: Examining potential module: pgadmin.browser.server_groups.servers.databases.external_tables.tests
2018-12-06 10:07:41,583: INFO pgadmin: Examining potential module: pgadmin.browser.server_groups.servers.databases.foreign_data_wrappers.foreign_servers
2018-12-06 10:07:41,588: INFO pgadmin: Examining potential module: pgadmin.browser.server_groups.servers.databases.foreign_data_wrappers.tests
2018-12-06 10:07:41,596: INFO pgadmin: Examining potential module: pgadmin.browser.server_groups.servers.databases.foreign_data_wrappers.foreign_servers.tests
2018-12-06 10:07:41,596: INFO pgadmin: Examining potential module: pgadmin.browser.server_groups.servers.databases.foreign_data_wrappers.foreign_servers.user_mapping
2018-12-06 10:07:41,607: INFO pgadmin: Examining potential module: pgadmin.browser.server_groups.servers.databases.foreign_data_wrappers.foreign_servers.user_mapping.tests
2018-12-06 10:07:41,615: INFO pgadmin: Examining potential module: pgadmin.browser.server_groups.servers.databases.languages.tests
2018-12-06 10:07:41,622: INFO pgadmin: Examining potential module: pgadmin.browser.server_groups.servers.databases.schemas.catalog_objects
2018-12-06 10:07:41,624: INFO pgadmin: Examining potential module: pgadmin.browser.server_groups.servers.databases.schemas.collations
2018-12-06 10:07:41,628: INFO pgadmin: Examining potential module: pgadmin.browser.server_groups.servers.databases.schemas.domains
2018-12-06 10:07:41,632: INFO pgadmin: Examining potential module: pgadmin.browser.server_groups.servers.databases.schemas.foreign_tables
2018-12-06 10:07:41,639: INFO pgadmin: Examining potential module: pgadmin.browser.server_groups.servers.databases.schemas.fts_configurations
2018-12-06 10:07:41,643: INFO pgadmin: Examining potential module: pgadmin.browser.server_groups.servers.databases.schemas.fts_dictionaries
2018-12-06 10:07:41,647: INFO pgadmin: Examining potential module: pgadmin.browser.server_groups.servers.databases.schemas.fts_parser
2018-12-06 10:07:41,652: INFO pgadmin: Examining potential module: pgadmin.browser.server_groups.servers.databases.schemas.fts_templates
2018-12-06 10:07:41,655: INFO pgadmin: Examining potential module: pgadmin.browser.server_groups.servers.databases.schemas.functions
2018-12-06 10:07:41,655: INFO pgadmin: Examining potential module: pgadmin.browser.server_groups.servers.databases.schemas.packages
2018-12-06 10:07:41,660: INFO pgadmin: Examining potential module: pgadmin.browser.server_groups.servers.databases.schemas.sequences
2018-12-06 10:07:41,664: INFO pgadmin: Examining potential module: pgadmin.browser.server_groups.servers.databases.schemas.synonyms
2018-12-06 10:07:41,668: INFO pgadmin: Examining potential module: pgadmin.browser.server_groups.servers.databases.schemas.tables
2018-12-06 10:07:41,687: INFO pgadmin: Examining potential module: pgadmin.browser.server_groups.servers.databases.schemas.tests
2018-12-06 10:07:41,687: INFO pgadmin: Examining potential module: pgadmin.browser.server_groups.servers.databases.schemas.types
2018-12-06 10:07:41,694: INFO pgadmin: Examining potential module: pgadmin.browser.server_groups.servers.databases.schemas.utils
2018-12-06 10:07:41,694: INFO pgadmin: Examining potential module: pgadmin.browser.server_groups.servers.databases.schemas.views
2018-12-06 10:07:41,709: INFO pgadmin: Examining potential module: pgadmin.browser.server_groups.servers.databases.schemas.catalog_objects.columns
2018-12-06 10:07:41,720: INFO pgadmin: Examining potential module: pgadmin.browser.server_groups.servers.databases.schemas.collations.tests
2018-12-06 10:07:41,728: INFO pgadmin: Examining potential module: pgadmin.browser.server_groups.servers.databases.schemas.domains.domain_constraints
2018-12-06 10:07:41,732: INFO pgadmin: Examining potential module: pgadmin.browser.server_groups.servers.databases.schemas.domains.tests
2018-12-06 10:07:41,748: INFO pgadmin: Examining potential module: pgadmin.browser.server_groups.servers.databases.schemas.foreign_tables.tests
2018-12-06 10:07:41,762: INFO pgadmin: Examining potential module: pgadmin.browser.server_groups.servers.databases.schemas.fts_configurations.tests
2018-12-06 10:07:41,773: INFO pgadmin: Examining potential module: pgadmin.browser.server_groups.servers.databases.schemas.fts_dictionaries.tests
2018-12-06 10:07:41,781: INFO pgadmin: Examining potential module: pgadmin.browser.server_groups.servers.databases.schemas.fts_parser.tests
2018-12-06 10:07:41,794: INFO pgadmin: Examining potential module: pgadmin.browser.server_groups.servers.databases.schemas.fts_templates.tests
2018-12-06 10:07:41,803: INFO pgadmin: Examining potential module: pgadmin.browser.server_groups.servers.databases.schemas.functions.tests
2018-12-06 10:07:41,814: INFO pgadmin: Examining potential module: pgadmin.browser.server_groups.servers.databases.schemas.functions.tests
2018-12-06 10:07:41,824: INFO pgadmin: Examining potential module: pgadmin.browser.server_groups.servers.databases.schemas.functions.tests
2018-12-06 10:07:41,836: INFO pgadmin: Examining potential module: pgadmin.browser.server_groups.servers.databases.schemas.packages.edbfuncs
2018-12-06 10:07:41,839: INFO pgadmin: Examining potential module: pgadmin.browser.server_groups.servers.databases.schemas.packages.edbvars
2018-12-06 10:07:41,841: INFO pgadmin: Examining potential module: pgadmin.browser.server_groups.servers.databases.schemas.packages.tests
2018-12-06 10:07:41,849: INFO pgadmin: Examining potential module: pgadmin.browser.server_groups.servers.databases.schemas.packages.edbfuncs.tests
2018-12-06 10:07:41,855: INFO pgadmin: Examining potential module: pgadmin.browser.server_groups.servers.databases.schemas.packages.edbfuncs.tests
2018-12-06 10:07:41,862: INFO pgadmin: Examining potential module: pgadmin.browser.server_groups.servers.databases.schemas.sequences.tests
2018-12-06 10:07:41,898: INFO pgadmin: Examining potential module: pgadmin.browser.server_groups.servers.databases.schemas.synonyms.tests
2018-12-06 10:07:41,906: INFO pgadmin: Examining potential module: pgadmin.browser.server_groups.servers.databases.schemas.tables.base_partition_table
2018-12-06 10:07:41,907: INFO pgadmin: Examining potential module: pgadmin.browser.server_groups.servers.databases.schemas.tables.column
2018-12-06 10:07:41,912: INFO pgadmin: Examining potential module: pgadmin.browser.server_groups.servers.databases.schemas.tables.constraints
2018-12-06 10:07:41,914: INFO pgadmin: Examining potential module: pgadmin.browser.server_groups.servers.databases.schemas.tables.indexes
2018-12-06 10:07:41,922: INFO pgadmin: Examining potential module: pgadmin.browser.server_groups.servers.databases.schemas.tables.partitions
2018-12-06 10:07:41,923: INFO pgadmin: Examining potential module: pgadmin.browser.server_groups.servers.databases.schemas.tables.rules
2018-12-06 10:07:41,926: INFO pgadmin: Examining potential module: pgadmin.browser.server_groups.servers.databases.schemas.tables.tests
2018-12-06 10:07:41,927: INFO pgadmin: Examining potential module: pgadmin.browser.server_groups.servers.databases.schemas.tables.triggers
2018-12-06 10:07:41,932: INFO pgadmin: Examining potential module: pgadmin.browser.server_groups.servers.databases.schemas.tables.utils
2018-12-06 10:07:41,952: INFO pgadmin: Examining potential module: pgadmin.browser.server_groups.servers.databases.schemas.tables.column.tests
2018-12-06 10:07:41,959: INFO pgadmin: Examining potential module: pgadmin.browser.server_groups.servers.databases.schemas.tables.constraints.check_constraint
2018-12-06 10:07:41,964: INFO pgadmin: Examining potential module: pgadmin.browser.server_groups.servers.databases.schemas.tables.constraints.exclusion_constraint
2018-12-06 10:07:41,971: INFO pgadmin: Examining potential module: pgadmin.browser.server_groups.servers.databases.schemas.tables.constraints.foreign_key
2018-12-06 10:07:41,978: INFO pgadmin: Examining potential module: pgadmin.browser.server_groups.servers.databases.schemas.tables.constraints.index_constraint
2018-12-06 10:07:41,986: INFO pgadmin: Examining potential module: pgadmin.browser.server_groups.servers.databases.schemas.tables.constraints.tests
2018-12-06 10:07:41,987: INFO pgadmin: Examining potential module: pgadmin.browser.server_groups.servers.databases.schemas.tables.constraints.type
2018-12-06 10:07:41,989: INFO pgadmin: Examining potential module: pgadmin.browser.server_groups.servers.databases.schemas.tables.constraints.check_constraint.tests
2018-12-06 10:07:42,029: INFO pgadmin: Examining potential module: pgadmin.browser.server_groups.servers.databases.schemas.tables.indexes.tests
2018-12-06 10:07:42,041: INFO pgadmin: Examining potential module: pgadmin.browser.server_groups.servers.databases.schemas.tables.partitions.tests
2018-12-06 10:07:42,041: INFO pgadmin: Examining potential module: pgadmin.browser.server_groups.servers.databases.schemas.tables.partitions.tests
2018-12-06 10:07:42,047: INFO pgadmin: Examining potential module: pgadmin.browser.server_groups.servers.databases.schemas.tables.rules.tests
2018-12-06 10:07:42,055: INFO pgadmin: Examining potential module: pgadmin.browser.server_groups.servers.databases.schemas.tables.triggers.tests
2018-12-06 10:07:42,065: INFO pgadmin: Examining potential module: pgadmin.browser.server_groups.servers.databases.schemas.types.tests
2018-12-06 10:07:42,079: INFO pgadmin: Examining potential module: pgadmin.browser.server_groups.servers.databases.schemas.views.children
2018-12-06 10:07:42,079: INFO pgadmin: Examining potential module: pgadmin.browser.server_groups.servers.databases.schemas.views.tests
2018-12-06 10:07:42,126: INFO pgadmin: Examining potential module: pgadmin.browser.server_groups.servers.databases.schemas.views.children
2018-12-06 10:07:42,127: INFO pgadmin: Examining potential module: pgadmin.browser.server_groups.servers.databases.schemas.views.tests
2018-12-06 10:07:42,173: INFO pgadmin: Examining potential module: pgadmin.browser.server_groups.servers.databases.schemas.catalog_objects
2018-12-06 10:07:42,173: INFO pgadmin: Examining potential module: pgadmin.browser.server_groups.servers.databases.schemas.collations
2018-12-06 10:07:42,174: INFO pgadmin: Examining potential module: pgadmin.browser.server_groups.servers.databases.schemas.domains
2018-12-06 10:07:42,174: INFO pgadmin: Examining potential module: pgadmin.browser.server_groups.servers.databases.schemas.foreign_tables
2018-12-06 10:07:42,174: INFO pgadmin: Examining potential module: pgadmin.browser.server_groups.servers.databases.schemas.fts_configurations
2018-12-06 10:07:42,174: INFO pgadmin: Examining potential module: pgadmin.browser.server_groups.servers.databases.schemas.fts_dictionaries
2018-12-06 10:07:42,174: INFO pgadmin: Examining potential module: pgadmin.browser.server_groups.servers.databases.schemas.fts_parser
2018-12-06 10:07:42,175: INFO pgadmin: Examining potential module: pgadmin.browser.server_groups.servers.databases.schemas.fts_templates
2018-12-06 10:07:42,175: INFO pgadmin: Examining potential module: pgadmin.browser.server_groups.servers.databases.schemas.functions
2018-12-06 10:07:42,175: INFO pgadmin: Examining potential module: pgadmin.browser.server_groups.servers.databases.schemas.packages
2018-12-06 10:07:42,175: INFO pgadmin: Examining potential module: pgadmin.browser.server_groups.servers.databases.schemas.sequences
2018-12-06 10:07:42,175: INFO pgadmin: Examining potential module: pgadmin.browser.server_groups.servers.databases.schemas.synonyms
2018-12-06 10:07:42,176: INFO pgadmin: Examining potential module: pgadmin.browser.server_groups.servers.databases.schemas.tables
2018-12-06 10:07:42,176: INFO pgadmin: Examining potential module: pgadmin.browser.server_groups.servers.databases.schemas.tests
2018-12-06 10:07:42,176: INFO pgadmin: Examining potential module: pgadmin.browser.server_groups.servers.databases.schemas.types
2018-12-06 10:07:42,176: INFO pgadmin: Examining potential module: pgadmin.browser.server_groups.servers.databases.schemas.utils
2018-12-06 10:07:42,176: INFO pgadmin: Examining potential module: pgadmin.browser.server_groups.servers.databases.schemas.views
2018-12-06 10:07:42,661: INFO pgadmin: Examining potential module: pgadmin.browser.server_groups.servers.pgagent.schedules
2018-12-06 10:07:42,665: INFO pgadmin: Examining potential module: pgadmin.browser.server_groups.servers.pgagent.steps
2018-12-06 10:07:42,668: INFO pgadmin: Examining potential module: pgadmin.browser.server_groups.servers.pgagent.tests
2018-12-06 10:07:42,680: INFO pgadmin: Examining potential module: pgadmin.browser.server_groups.servers.resource_groups.tests
2018-12-06 10:07:42,685: INFO pgadmin: Examining potential module: pgadmin.browser.server_groups.servers.roles.tests
2018-12-06 10:07:42,690: INFO pgadmin: Examining potential module: pgadmin.browser.server_groups.servers.tablespaces.tests
2018-12-06 10:07:42,696: INFO pgadmin: Examining potential module: pgadmin.dashboard
2018-12-06 10:07:42,699: INFO pgadmin: Registering blueprint module: <pgadmin.dashboard.DashboardModule object at 0x7f2f75bf6890>
2018-12-06 10:07:42,700: INFO pgadmin: Examining potential module: pgadmin.dashboard.tests
2018-12-06 10:07:42,708: INFO pgadmin: Examining potential module: pgadmin.feature_tests
2018-12-06 10:07:42,709: INFO pgadmin: Examining potential module: pgadmin.help
2018-12-06 10:07:42,709: INFO pgadmin: Registering blueprint module: <pgadmin.help.HelpModule object at 0x7f2f75c55d50>
2018-12-06 10:07:42,710: INFO pgadmin: Examining potential module: pgadmin.misc
2018-12-06 10:07:42,711: INFO pgadmin: Registering blueprint module: <pgadmin.misc.MiscModule object at 0x7f2f75bfe310>
2018-12-06 10:07:42,711: INFO pgadmin: Examining potential module: pgadmin.misc.bgprocess
2018-12-06 10:07:42,736: INFO pgadmin: Examining potential module: pgadmin.misc.depends
2018-12-06 10:07:42,737: INFO pgadmin: Examining potential module: pgadmin.misc.file_manager
2018-12-06 10:07:42,744: INFO pgadmin: Examining potential module: pgadmin.misc.sql
2018-12-06 10:07:42,745: INFO pgadmin: Examining potential module: pgadmin.misc.statistics
2018-12-06 10:07:42,747: INFO pgadmin: Examining potential module: pgadmin.misc.bgprocess.process_executor
2018-12-06 10:07:42,749: INFO pgadmin: Examining potential module: pgadmin.misc.bgprocess.processes
2018-12-06 10:07:42,755: INFO pgadmin: Examining potential module: pgadmin.model
2018-12-06 10:07:42,755: INFO pgadmin: Examining potential module: pgadmin.preferences
2018-12-06 10:07:42,757: INFO pgadmin: Registering blueprint module: <pgadmin.preferences.PreferencesModule object at 0x7f2f755fce90>
2018-12-06 10:07:42,758: INFO pgadmin: Examining potential module: pgadmin.redirects
2018-12-06 10:07:42,759: INFO pgadmin: Registering blueprint module: <pgadmin.utils.PgAdminModule object at 0x7f2f7560b4d0>
2018-12-06 10:07:42,760: INFO pgadmin: Examining potential module: pgadmin.settings
2018-12-06 10:07:42,760: INFO pgadmin: Registering blueprint module: <pgadmin.settings.SettingsModule object at 0x7f2f7b0a9750>
2018-12-06 10:07:42,762: INFO pgadmin: Examining potential module: pgadmin.setup
2018-12-06 10:07:42,762: INFO pgadmin: Examining potential module: pgadmin.tools
2018-12-06 10:07:42,763: INFO pgadmin: Registering blueprint module: <pgadmin.tools.ToolsModule object at 0x7f2f7560be50>
2018-12-06 10:07:42,763: INFO pgadmin: Examining potential module: pgadmin.tools.backup
2018-12-06 10:07:42,767: INFO pgadmin: Examining potential module: pgadmin.tools.datagrid
2018-12-06 10:07:42,831: INFO pgadmin: Examining potential module: pgadmin.tools.debugger
2018-12-06 10:07:42,840: INFO pgadmin: Examining potential module: pgadmin.tools.grant_wizard
2018-12-06 10:07:42,843: INFO pgadmin: Examining potential module: pgadmin.tools.import_export
2018-12-06 10:07:42,846: INFO pgadmin: Examining potential module: pgadmin.tools.maintenance
2018-12-06 10:07:42,848: INFO pgadmin: Examining potential module: pgadmin.tools.restore
2018-12-06 10:07:42,850: INFO pgadmin: Examining potential module: pgadmin.tools.sqleditor
2018-12-06 10:07:42,850: INFO pgadmin: Examining potential module: pgadmin.tools.user_management
2018-12-06 10:07:42,853: INFO pgadmin: Examining potential module: pgadmin.tools.backup.tests
2018-12-06 10:07:42,868: INFO pgadmin: Examining potential module: pgadmin.tools.import_export.tests
2018-12-06 10:07:42,870: INFO pgadmin: Examining potential module: pgadmin.tools.maintenance.tests
2018-12-06 10:07:42,871: INFO pgadmin: Examining potential module: pgadmin.tools.restore.tests
2018-12-06 10:07:42,873: INFO pgadmin: Examining potential module: pgadmin.tools.sqleditor.command
2018-12-06 10:07:42,873: INFO pgadmin: Examining potential module: pgadmin.tools.sqleditor.tests
2018-12-06 10:07:42,873: INFO pgadmin: Examining potential module: pgadmin.tools.sqleditor.utils
2018-12-06 10:07:42,881: INFO pgadmin: Examining potential module: pgadmin.utils
NOTE: Configuring authentication for DESKTOP mode.
pgAdmin 4 - Application Initialisation
======================================

Non-ASCII character '\xc5' in file <https://jenkins.pgadmin.org/job/pgadmin4-master-python27/ws/web/pgadmin/tools/sqleditor/tests/test_encoding_charset.py> on line 59, but no encoding declared; see http://python.org/dev/peps/pep-0263/ for details (test_encoding_charset.py, line 59)
ERROR: Error detected when running the Python tests.
ERROR: Error detected when running the Python tests.
Build step 'Execute shell' marked build as failure

Reply | Threaded
Open this post in threaded view
|

Re: Build failed in Jenkins: pgadmin4-master-python27 #825

Dave Page-7
In reply to this post by Khushboo Vashi
Thanks, applied.
On Thu, Dec 6, 2018 at 5:43 AM Khushboo Vashi
<[hidden email]> wrote:

>
> Hi,
>
> Please find the attached fix for this failure.
>
> Thanks,
> Khushboo
>
>
>
> On Wed, Dec 5, 2018 at 9:45 AM pgAdmin 4 Jenkins <[hidden email]> wrote:
>>
>> See <https://jenkins.pgadmin.org/job/pgadmin4-master-python27/825/display/redirect?page=changes>
>>
>> Changes:
>>
>> [Dave Page] Allow servers to be pre-loaded into container deployments. Fixes #3801
>>
>> ------------------------------------------
>> [...truncated 22.20 KB...]
>> Requirement already satisfied: testtools==2.3.0 in ./pgadmin-venv/lib/python2.7/site-packages (from -r web/regression/requirements.txt (line 12)) (2.3.0)
>> Requirement already satisfied: traceback2==1.4.0 in ./pgadmin-venv/lib/python2.7/site-packages (from -r web/regression/requirements.txt (line 13)) (1.4.0)
>> Requirement already satisfied: unittest2==1.1.0 in ./pgadmin-venv/lib/python2.7/site-packages (from -r web/regression/requirements.txt (line 14)) (1.1.0)
>> Collecting selenium==3.11.0 (from -r web/regression/requirements.txt (line 19))
>>   Using cached https://files.pythonhosted.org/packages/d4/28/8124d32415bd3d67fabea52480395427576b582771283e89ce10a56d9e5b/selenium-3.11.0.tar.gz
>> Collecting mock===2.0.0 (from -r web/regression/requirements.txt (line 29))
>>   Using cached https://files.pythonhosted.org/packages/0c/53/014354fc93c591ccc4abff12c473ad565a2eb24dcd82490fae33dbf2539f/mock-2.0.0.tar.gz
>> Collecting chromedriver_installer==0.0.6 (from -r web/regression/requirements.txt (line 33))
>>   Using cached https://files.pythonhosted.org/packages/c8/01/0a8a725bb605f68923aba16099a01cbbfe547c8b7dc96fd9a554424f6524/chromedriver_installer-0.0.6.tar.gz
>> Requirement already satisfied: itsdangerous>=0.21 in ./pgadmin-venv/lib/python2.7/site-packages (from Flask==0.12.4->-r web/regression/../../requirements.txt (line 9)) (1.1.0)
>> Requirement already satisfied: click>=2.0 in ./pgadmin-venv/lib/python2.7/site-packages (from Flask==0.12.4->-r web/regression/../../requirements.txt (line 9)) (7.0)
>> Requirement already satisfied: Werkzeug>=0.7 in ./pgadmin-venv/lib/python2.7/site-packages (from Flask==0.12.4->-r web/regression/../../requirements.txt (line 9)) (0.14.1)
>> Requirement already satisfied: Jinja2>=2.4 in ./pgadmin-venv/lib/python2.7/site-packages (from Flask==0.12.4->-r web/regression/../../requirements.txt (line 9)) (2.10)
>> Requirement already satisfied: alembic>=0.6 in ./pgadmin-venv/lib/python2.7/site-packages (from Flask-Migrate==2.1.1->-r web/regression/../../requirements.txt (line 13)) (1.0.5)
>> Requirement already satisfied: webencodings in ./pgadmin-venv/lib/python2.7/site-packages (from html5lib==1.0.1->-r web/regression/../../requirements.txt (line 17)) (0.5.1)
>> Requirement already satisfied: Flask-BabelEx>=0.9.3 in ./pgadmin-venv/lib/python2.7/site-packages (from Flask-Security>=3.0.0->-r web/regression/../../requirements.txt (line 41)) (0.9.3)
>> Requirement already satisfied: paramiko>=1.15.2 in ./pgadmin-venv/lib/python2.7/site-packages (from sshtunnel>=0.1.3->-r web/regression/../../requirements.txt (line 42)) (2.4.2)
>> Requirement already satisfied: argparse in ./pgadmin-venv/lib/python2.7/site-packages (from unittest2==1.1.0->-r web/regression/requirements.txt (line 14)) (1.4.0)
>> Collecting funcsigs>=1 (from mock===2.0.0->-r web/regression/requirements.txt (line 29))
>>   Using cached https://files.pythonhosted.org/packages/94/4a/db842e7a0545de1cdb0439bb80e6e42dfe82aaeaadd4072f2263a4fbed23/funcsigs-1.0.2.tar.gz
>> Requirement already satisfied: MarkupSafe>=0.23 in ./pgadmin-venv/lib/python2.7/site-packages (from Jinja2>=2.4->Flask==0.12.4->-r web/regression/../../requirements.txt (line 9)) (1.1.0)
>> Requirement already satisfied: python-editor>=0.3 in ./pgadmin-venv/lib/python2.7/site-packages (from alembic>=0.6->Flask-Migrate==2.1.1->-r web/regression/../../requirements.txt (line 13)) (1.0.3)
>> Requirement already satisfied: Mako in ./pgadmin-venv/lib/python2.7/site-packages (from alembic>=0.6->Flask-Migrate==2.1.1->-r web/regression/../../requirements.txt (line 13)) (1.0.7)
>> Requirement already satisfied: Babel>=1.0 in ./pgadmin-venv/lib/python2.7/site-packages (from Flask-BabelEx>=0.9.3->Flask-Security>=3.0.0->-r web/regression/../../requirements.txt (line 41)) (2.6.0)
>> Requirement already satisfied: pynacl>=1.0.1 in ./pgadmin-venv/lib/python2.7/site-packages (from paramiko>=1.15.2->sshtunnel>=0.1.3->-r web/regression/../../requirements.txt (line 42)) (1.3.0)
>> Requirement already satisfied: cryptography>=1.5 in ./pgadmin-venv/lib/python2.7/site-packages (from paramiko>=1.15.2->sshtunnel>=0.1.3->-r web/regression/../../requirements.txt (line 42)) (2.4.2)
>> Requirement already satisfied: bcrypt>=3.1.3 in ./pgadmin-venv/lib/python2.7/site-packages (from paramiko>=1.15.2->sshtunnel>=0.1.3->-r web/regression/../../requirements.txt (line 42)) (3.1.4)
>> Requirement already satisfied: pyasn1>=0.1.7 in ./pgadmin-venv/lib/python2.7/site-packages (from paramiko>=1.15.2->sshtunnel>=0.1.3->-r web/regression/../../requirements.txt (line 42)) (0.4.4)
>> Requirement already satisfied: cffi>=1.4.1 in ./pgadmin-venv/lib/python2.7/site-packages (from pynacl>=1.0.1->paramiko>=1.15.2->sshtunnel>=0.1.3->-r web/regression/../../requirements.txt (line 42)) (1.11.5)
>> Requirement already satisfied: idna>=2.1 in ./pgadmin-venv/lib/python2.7/site-packages (from cryptography>=1.5->paramiko>=1.15.2->sshtunnel>=0.1.3->-r web/regression/../../requirements.txt (line 42)) (2.8)
>> Requirement already satisfied: enum34; python_version < "3" in ./pgadmin-venv/lib/python2.7/site-packages (from cryptography>=1.5->paramiko>=1.15.2->sshtunnel>=0.1.3->-r web/regression/../../requirements.txt (line 42)) (1.1.6)
>> Requirement already satisfied: asn1crypto>=0.21.0 in ./pgadmin-venv/lib/python2.7/site-packages (from cryptography>=1.5->paramiko>=1.15.2->sshtunnel>=0.1.3->-r web/regression/../../requirements.txt (line 42)) (0.24.0)
>> Requirement already satisfied: ipaddress; python_version < "3" in ./pgadmin-venv/lib/python2.7/site-packages (from cryptography>=1.5->paramiko>=1.15.2->sshtunnel>=0.1.3->-r web/regression/../../requirements.txt (line 42)) (1.0.22)
>> Requirement already satisfied: pycparser in ./pgadmin-venv/lib/python2.7/site-packages (from cffi>=1.4.1->pynacl>=1.0.1->paramiko>=1.15.2->sshtunnel>=0.1.3->-r web/regression/../../requirements.txt (line 42)) (2.19)
>> Skipping bdist_wheel for pycodestyle, due to binaries being disabled for it.
>> Skipping bdist_wheel for pyperclip, due to binaries being disabled for it.
>> Skipping bdist_wheel for testscenarios, due to binaries being disabled for it.
>> Skipping bdist_wheel for selenium, due to binaries being disabled for it.
>> Skipping bdist_wheel for mock, due to binaries being disabled for it.
>> Skipping bdist_wheel for chromedriver-installer, due to binaries being disabled for it.
>> Skipping bdist_wheel for funcsigs, due to binaries being disabled for it.
>> Installing collected packages: pycodestyle, pyperclip, testscenarios, selenium, funcsigs, mock, chromedriver-installer
>>   Running setup.py install for pycodestyle: started
>>     Running setup.py install for pycodestyle: finished with status 'done'
>>   Running setup.py install for pyperclip: started
>>     Running setup.py install for pyperclip: finished with status 'done'
>>   Running setup.py install for testscenarios: started
>>     Running setup.py install for testscenarios: finished with status 'done'
>>   Running setup.py install for selenium: started
>>     Running setup.py install for selenium: finished with status 'done'
>>   Running setup.py install for funcsigs: started
>>     Running setup.py install for funcsigs: finished with status 'done'
>>   Running setup.py install for mock: started
>>     Running setup.py install for mock: finished with status 'done'
>>   Running setup.py install for chromedriver-installer: started
>>     Running setup.py install for chromedriver-installer: finished with status 'done'
>> Successfully installed chromedriver-installer-0.0.6 funcsigs-1.0.2 mock-2.0.0 pycodestyle-2.3.1 pyperclip-1.6.5 selenium-3.11.0 testscenarios-0.5.0
>> Running PEP-8 checks...
>>
>> cd web && pycodestyle --config=.pycodestyle .
>> Running regression tests...
>>
>> <https://jenkins.pgadmin.org/job/pgadmin4-master-python27/ws/pgadmin-venv/lib/python2.7/site-packages/psycopg2/__init__.py>:144: UserWarning: The psycopg2 wheel package will be renamed from release 2.8; in order to keep installing from binary please use "pip install psycopg2-binary" instead. For details see: <http://initd.org/psycopg/docs/install.html#binary-install-from-pypi>.
>>   """)
>> 2018-12-05 17:45:01,564: INFO   pgadmin:        ########################################################
>> 2018-12-05 17:45:01,564: INFO   pgadmin:        Starting pgAdmin 4 v3.6...
>> 2018-12-05 17:45:01,564: INFO   pgadmin:        ########################################################
>> 2018-12-05 17:45:01,564: DEBUG  pgadmin:        Python syspath: ['<https://jenkins.pgadmin.org/job/pgadmin4-master-python27/ws/web/regression',> '<https://jenkins.pgadmin.org/job/pgadmin4-master-python27/ws/web',> '<https://jenkins.pgadmin.org/job/pgadmin4-master-python27/ws/web/regression',> '<https://jenkins.pgadmin.org/job/pgadmin4-master-python27/ws/pgadmin-venv/lib/python27.zip',> '<https://jenkins.pgadmin.org/job/pgadmin4-master-python27/ws/pgadmin-venv/lib/python2.7',> '<https://jenkins.pgadmin.org/job/pgadmin4-master-python27/ws/pgadmin-venv/lib/python2.7/plat-linux2',> '<https://jenkins.pgadmin.org/job/pgadmin4-master-python27/ws/pgadmin-venv/lib/python2.7/lib-tk',> '<https://jenkins.pgadmin.org/job/pgadmin4-master-python27/ws/pgadmin-venv/lib/python2.7/lib-old',> '<https://jenkins.pgadmin.org/job/pgadmin4-master-python27/ws/pgadmin-venv/lib/python2.7/lib-dynload',> '/usr/local/python-2.7/lib/python2.7', '/usr/local/python-2.7/lib/python2.7/plat-linux2', '/usr/local/python-2.7/lib/python2.7/lib-tk', '<https://jenkins.pgadmin.org/job/pgadmin4-master-python27/ws/pgadmin-venv/lib/python2.7/site-packages']>
>> 2018-12-05 17:45:01,565: DEBUG  pgadmin:        Available translations: [Locale('pl'), Locale('zh'), Locale('de'), Locale('ja'), Locale('ru'), Locale('fr'), Locale('ko'), Locale('es')]
>> 2018-12-05 17:45:02,102: INFO   pgadmin:        Examining potential module: pgadmin.about
>> 2018-12-05 17:45:02,103: INFO   pgadmin:        Registering blueprint module: <pgadmin.about.AboutModule object at 0x7f5ef3b5c210>
>> 2018-12-05 17:45:02,104: INFO   pgadmin:        Examining potential module: pgadmin.browser
>> 2018-12-05 17:45:02,104: INFO   pgadmin:        Registering blueprint module: <pgadmin.browser.BrowserModule object at 0x7f5ef80b7ed0>
>> 2018-12-05 17:45:02,105: INFO   pgadmin:        Examining potential module: pgadmin.browser.collection
>> 2018-12-05 17:45:02,105: INFO   pgadmin:        Examining potential module: pgadmin.browser.register_browser_preferences
>> 2018-12-05 17:45:02,105: INFO   pgadmin:        Examining potential module: pgadmin.browser.server_groups
>> 2018-12-05 17:45:02,105: INFO   pgadmin:        Examining potential module: pgadmin.browser.tests
>> 2018-12-05 17:45:02,106: INFO   pgadmin:        Examining potential module: pgadmin.browser.utils
>> 2018-12-05 17:45:02,108: INFO   pgadmin:        Examining potential module: pgadmin.browser.server_groups.servers
>> 2018-12-05 17:45:02,108: INFO   pgadmin:        Examining potential module: pgadmin.browser.server_groups.tests
>> 2018-12-05 17:45:02,112: INFO   pgadmin:        Examining potential module: pgadmin.browser.server_groups.servers.databases
>> 2018-12-05 17:45:02,112: INFO   pgadmin:        Examining potential module: pgadmin.browser.server_groups.servers.gpdb
>> 2018-12-05 17:45:02,112: INFO   pgadmin:        Examining potential module: pgadmin.browser.server_groups.servers.pgagent
>> 2018-12-05 17:45:02,116: INFO   pgadmin:        Examining potential module: pgadmin.browser.server_groups.servers.ppas
>> 2018-12-05 17:45:02,117: INFO   pgadmin:        Examining potential module: pgadmin.browser.server_groups.servers.resource_groups
>> 2018-12-05 17:45:02,120: INFO   pgadmin:        Examining potential module: pgadmin.browser.server_groups.servers.roles
>> 2018-12-05 17:45:02,120: INFO   pgadmin:        Examining potential module: pgadmin.browser.server_groups.servers.tablespaces
>> 2018-12-05 17:45:02,121: INFO   pgadmin:        Examining potential module: pgadmin.browser.server_groups.servers.tests
>> 2018-12-05 17:45:02,121: INFO   pgadmin:        Examining potential module: pgadmin.browser.server_groups.servers.types
>> 2018-12-05 17:45:02,121: INFO   pgadmin:        Examining potential module: pgadmin.browser.server_groups.servers.utils
>> 2018-12-05 17:45:02,127: INFO   pgadmin:        Examining potential module: pgadmin.browser.server_groups.servers.databases.casts
>> 2018-12-05 17:45:02,131: INFO   pgadmin:        Examining potential module: pgadmin.browser.server_groups.servers.databases.event_triggers
>> 2018-12-05 17:45:02,135: INFO   pgadmin:        Examining potential module: pgadmin.browser.server_groups.servers.databases.extensions
>> 2018-12-05 17:45:02,138: INFO   pgadmin:        Examining potential module: pgadmin.browser.server_groups.servers.databases.external_tables
>> 2018-12-05 17:45:02,142: INFO   pgadmin:        Examining potential module: pgadmin.browser.server_groups.servers.databases.foreign_data_wrappers
>> 2018-12-05 17:45:02,147: INFO   pgadmin:        Examining potential module: pgadmin.browser.server_groups.servers.databases.languages
>> 2018-12-05 17:45:02,151: INFO   pgadmin:        Examining potential module: pgadmin.browser.server_groups.servers.databases.schemas
>> 2018-12-05 17:45:02,151: INFO   pgadmin:        Examining potential module: pgadmin.browser.server_groups.servers.databases.tests
>> 2018-12-05 17:45:02,151: INFO   pgadmin:        Examining potential module: pgadmin.browser.server_groups.servers.databases.utils
>> 2018-12-05 17:45:02,160: INFO   pgadmin:        Examining potential module: pgadmin.browser.server_groups.servers.databases.casts.tests
>> 2018-12-05 17:45:02,168: INFO   pgadmin:        Examining potential module: pgadmin.browser.server_groups.servers.databases.event_triggers.tests
>> 2018-12-05 17:45:02,174: INFO   pgadmin:        Examining potential module: pgadmin.browser.server_groups.servers.databases.extensions.tests
>> 2018-12-05 17:45:02,181: INFO   pgadmin:        Examining potential module: pgadmin.browser.server_groups.servers.databases.external_tables.actions
>> 2018-12-05 17:45:02,181: INFO   pgadmin:        Examining potential module: pgadmin.browser.server_groups.servers.databases.external_tables.mapping_utils
>> 2018-12-05 17:45:02,182: INFO   pgadmin:        Examining potential module: pgadmin.browser.server_groups.servers.databases.external_tables.properties
>> 2018-12-05 17:45:02,182: INFO   pgadmin:        Examining potential module: pgadmin.browser.server_groups.servers.databases.external_tables.reverse_engineer_ddl
>> 2018-12-05 17:45:02,182: INFO   pgadmin:        Examining potential module: pgadmin.browser.server_groups.servers.databases.external_tables.tests
>> 2018-12-05 17:45:02,185: INFO   pgadmin:        Examining potential module: pgadmin.browser.server_groups.servers.databases.foreign_data_wrappers.foreign_servers
>> 2018-12-05 17:45:02,190: INFO   pgadmin:        Examining potential module: pgadmin.browser.server_groups.servers.databases.foreign_data_wrappers.tests
>> 2018-12-05 17:45:02,197: INFO   pgadmin:        Examining potential module: pgadmin.browser.server_groups.servers.databases.foreign_data_wrappers.foreign_servers.tests
>> 2018-12-05 17:45:02,198: INFO   pgadmin:        Examining potential module: pgadmin.browser.server_groups.servers.databases.foreign_data_wrappers.foreign_servers.user_mapping
>> 2018-12-05 17:45:02,209: INFO   pgadmin:        Examining potential module: pgadmin.browser.server_groups.servers.databases.foreign_data_wrappers.foreign_servers.user_mapping.tests
>> 2018-12-05 17:45:02,217: INFO   pgadmin:        Examining potential module: pgadmin.browser.server_groups.servers.databases.languages.tests
>> 2018-12-05 17:45:02,224: INFO   pgadmin:        Examining potential module: pgadmin.browser.server_groups.servers.databases.schemas.catalog_objects
>> 2018-12-05 17:45:02,226: INFO   pgadmin:        Examining potential module: pgadmin.browser.server_groups.servers.databases.schemas.collations
>> 2018-12-05 17:45:02,229: INFO   pgadmin:        Examining potential module: pgadmin.browser.server_groups.servers.databases.schemas.domains
>> 2018-12-05 17:45:02,234: INFO   pgadmin:        Examining potential module: pgadmin.browser.server_groups.servers.databases.schemas.foreign_tables
>> 2018-12-05 17:45:02,240: INFO   pgadmin:        Examining potential module: pgadmin.browser.server_groups.servers.databases.schemas.fts_configurations
>> 2018-12-05 17:45:02,245: INFO   pgadmin:        Examining potential module: pgadmin.browser.server_groups.servers.databases.schemas.fts_dictionaries
>> 2018-12-05 17:45:02,249: INFO   pgadmin:        Examining potential module: pgadmin.browser.server_groups.servers.databases.schemas.fts_parser
>> 2018-12-05 17:45:02,253: INFO   pgadmin:        Examining potential module: pgadmin.browser.server_groups.servers.databases.schemas.fts_templates
>> 2018-12-05 17:45:02,257: INFO   pgadmin:        Examining potential module: pgadmin.browser.server_groups.servers.databases.schemas.functions
>> 2018-12-05 17:45:02,257: INFO   pgadmin:        Examining potential module: pgadmin.browser.server_groups.servers.databases.schemas.packages
>> 2018-12-05 17:45:02,261: INFO   pgadmin:        Examining potential module: pgadmin.browser.server_groups.servers.databases.schemas.sequences
>> 2018-12-05 17:45:02,266: INFO   pgadmin:        Examining potential module: pgadmin.browser.server_groups.servers.databases.schemas.synonyms
>> 2018-12-05 17:45:02,269: INFO   pgadmin:        Examining potential module: pgadmin.browser.server_groups.servers.databases.schemas.tables
>> 2018-12-05 17:45:02,289: INFO   pgadmin:        Examining potential module: pgadmin.browser.server_groups.servers.databases.schemas.tests
>> 2018-12-05 17:45:02,289: INFO   pgadmin:        Examining potential module: pgadmin.browser.server_groups.servers.databases.schemas.types
>> 2018-12-05 17:45:02,296: INFO   pgadmin:        Examining potential module: pgadmin.browser.server_groups.servers.databases.schemas.utils
>> 2018-12-05 17:45:02,296: INFO   pgadmin:        Examining potential module: pgadmin.browser.server_groups.servers.databases.schemas.views
>> 2018-12-05 17:45:02,311: INFO   pgadmin:        Examining potential module: pgadmin.browser.server_groups.servers.databases.schemas.catalog_objects.columns
>> 2018-12-05 17:45:02,322: INFO   pgadmin:        Examining potential module: pgadmin.browser.server_groups.servers.databases.schemas.collations.tests
>> 2018-12-05 17:45:02,330: INFO   pgadmin:        Examining potential module: pgadmin.browser.server_groups.servers.databases.schemas.domains.domain_constraints
>> 2018-12-05 17:45:02,334: INFO   pgadmin:        Examining potential module: pgadmin.browser.server_groups.servers.databases.schemas.domains.tests
>> 2018-12-05 17:45:02,350: INFO   pgadmin:        Examining potential module: pgadmin.browser.server_groups.servers.databases.schemas.foreign_tables.tests
>> 2018-12-05 17:45:02,365: INFO   pgadmin:        Examining potential module: pgadmin.browser.server_groups.servers.databases.schemas.fts_configurations.tests
>> 2018-12-05 17:45:02,376: INFO   pgadmin:        Examining potential module: pgadmin.browser.server_groups.servers.databases.schemas.fts_dictionaries.tests
>> 2018-12-05 17:45:02,384: INFO   pgadmin:        Examining potential module: pgadmin.browser.server_groups.servers.databases.schemas.fts_parser.tests
>> 2018-12-05 17:45:02,397: INFO   pgadmin:        Examining potential module: pgadmin.browser.server_groups.servers.databases.schemas.fts_templates.tests
>> 2018-12-05 17:45:02,406: INFO   pgadmin:        Examining potential module: pgadmin.browser.server_groups.servers.databases.schemas.functions.tests
>> 2018-12-05 17:45:02,417: INFO   pgadmin:        Examining potential module: pgadmin.browser.server_groups.servers.databases.schemas.functions.tests
>> 2018-12-05 17:45:02,428: INFO   pgadmin:        Examining potential module: pgadmin.browser.server_groups.servers.databases.schemas.functions.tests
>> 2018-12-05 17:45:02,439: INFO   pgadmin:        Examining potential module: pgadmin.browser.server_groups.servers.databases.schemas.packages.edbfuncs
>> 2018-12-05 17:45:02,443: INFO   pgadmin:        Examining potential module: pgadmin.browser.server_groups.servers.databases.schemas.packages.edbvars
>> 2018-12-05 17:45:02,445: INFO   pgadmin:        Examining potential module: pgadmin.browser.server_groups.servers.databases.schemas.packages.tests
>> 2018-12-05 17:45:02,453: INFO   pgadmin:        Examining potential module: pgadmin.browser.server_groups.servers.databases.schemas.packages.edbfuncs.tests
>> 2018-12-05 17:45:02,458: INFO   pgadmin:        Examining potential module: pgadmin.browser.server_groups.servers.databases.schemas.packages.edbfuncs.tests
>> 2018-12-05 17:45:02,466: INFO   pgadmin:        Examining potential module: pgadmin.browser.server_groups.servers.databases.schemas.sequences.tests
>> 2018-12-05 17:45:02,504: INFO   pgadmin:        Examining potential module: pgadmin.browser.server_groups.servers.databases.schemas.synonyms.tests
>> 2018-12-05 17:45:02,513: INFO   pgadmin:        Examining potential module: pgadmin.browser.server_groups.servers.databases.schemas.tables.base_partition_table
>> 2018-12-05 17:45:02,513: INFO   pgadmin:        Examining potential module: pgadmin.browser.server_groups.servers.databases.schemas.tables.column
>> 2018-12-05 17:45:02,519: INFO   pgadmin:        Examining potential module: pgadmin.browser.server_groups.servers.databases.schemas.tables.constraints
>> 2018-12-05 17:45:02,521: INFO   pgadmin:        Examining potential module: pgadmin.browser.server_groups.servers.databases.schemas.tables.indexes
>> 2018-12-05 17:45:02,529: INFO   pgadmin:        Examining potential module: pgadmin.browser.server_groups.servers.databases.schemas.tables.partitions
>> 2018-12-05 17:45:02,530: INFO   pgadmin:        Examining potential module: pgadmin.browser.server_groups.servers.databases.schemas.tables.rules
>> 2018-12-05 17:45:02,533: INFO   pgadmin:        Examining potential module: pgadmin.browser.server_groups.servers.databases.schemas.tables.tests
>> 2018-12-05 17:45:02,533: INFO   pgadmin:        Examining potential module: pgadmin.browser.server_groups.servers.databases.schemas.tables.triggers
>> 2018-12-05 17:45:02,539: INFO   pgadmin:        Examining potential module: pgadmin.browser.server_groups.servers.databases.schemas.tables.utils
>> 2018-12-05 17:45:02,558: INFO   pgadmin:        Examining potential module: pgadmin.browser.server_groups.servers.databases.schemas.tables.column.tests
>> 2018-12-05 17:45:02,565: INFO   pgadmin:        Examining potential module: pgadmin.browser.server_groups.servers.databases.schemas.tables.constraints.check_constraint
>> 2018-12-05 17:45:02,571: INFO   pgadmin:        Examining potential module: pgadmin.browser.server_groups.servers.databases.schemas.tables.constraints.exclusion_constraint
>> 2018-12-05 17:45:02,577: INFO   pgadmin:        Examining potential module: pgadmin.browser.server_groups.servers.databases.schemas.tables.constraints.foreign_key
>> 2018-12-05 17:45:02,583: INFO   pgadmin:        Examining potential module: pgadmin.browser.server_groups.servers.databases.schemas.tables.constraints.index_constraint
>> 2018-12-05 17:45:02,591: INFO   pgadmin:        Examining potential module: pgadmin.browser.server_groups.servers.databases.schemas.tables.constraints.tests
>> 2018-12-05 17:45:02,592: INFO   pgadmin:        Examining potential module: pgadmin.browser.server_groups.servers.databases.schemas.tables.constraints.type
>> 2018-12-05 17:45:02,593: INFO   pgadmin:        Examining potential module: pgadmin.browser.server_groups.servers.databases.schemas.tables.constraints.check_constraint.tests
>> 2018-12-05 17:45:02,633: INFO   pgadmin:        Examining potential module: pgadmin.browser.server_groups.servers.databases.schemas.tables.indexes.tests
>> 2018-12-05 17:45:02,645: INFO   pgadmin:        Examining potential module: pgadmin.browser.server_groups.servers.databases.schemas.tables.partitions.tests
>> 2018-12-05 17:45:02,645: INFO   pgadmin:        Examining potential module: pgadmin.browser.server_groups.servers.databases.schemas.tables.partitions.tests
>> 2018-12-05 17:45:02,651: INFO   pgadmin:        Examining potential module: pgadmin.browser.server_groups.servers.databases.schemas.tables.rules.tests
>> 2018-12-05 17:45:02,660: INFO   pgadmin:        Examining potential module: pgadmin.browser.server_groups.servers.databases.schemas.tables.triggers.tests
>> 2018-12-05 17:45:02,669: INFO   pgadmin:        Examining potential module: pgadmin.browser.server_groups.servers.databases.schemas.types.tests
>> 2018-12-05 17:45:02,683: INFO   pgadmin:        Examining potential module: pgadmin.browser.server_groups.servers.databases.schemas.views.children
>> 2018-12-05 17:45:02,684: INFO   pgadmin:        Examining potential module: pgadmin.browser.server_groups.servers.databases.schemas.views.tests
>> 2018-12-05 17:45:02,730: INFO   pgadmin:        Examining potential module: pgadmin.browser.server_groups.servers.databases.schemas.views.children
>> 2018-12-05 17:45:02,731: INFO   pgadmin:        Examining potential module: pgadmin.browser.server_groups.servers.databases.schemas.views.tests
>> 2018-12-05 17:45:02,777: INFO   pgadmin:        Examining potential module: pgadmin.browser.server_groups.servers.databases.schemas.catalog_objects
>> 2018-12-05 17:45:02,777: INFO   pgadmin:        Examining potential module: pgadmin.browser.server_groups.servers.databases.schemas.collations
>> 2018-12-05 17:45:02,777: INFO   pgadmin:        Examining potential module: pgadmin.browser.server_groups.servers.databases.schemas.domains
>> 2018-12-05 17:45:02,778: INFO   pgadmin:        Examining potential module: pgadmin.browser.server_groups.servers.databases.schemas.foreign_tables
>> 2018-12-05 17:45:02,778: INFO   pgadmin:        Examining potential module: pgadmin.browser.server_groups.servers.databases.schemas.fts_configurations
>> 2018-12-05 17:45:02,778: INFO   pgadmin:        Examining potential module: pgadmin.browser.server_groups.servers.databases.schemas.fts_dictionaries
>> 2018-12-05 17:45:02,778: INFO   pgadmin:        Examining potential module: pgadmin.browser.server_groups.servers.databases.schemas.fts_parser
>> 2018-12-05 17:45:02,778: INFO   pgadmin:        Examining potential module: pgadmin.browser.server_groups.servers.databases.schemas.fts_templates
>> 2018-12-05 17:45:02,779: INFO   pgadmin:        Examining potential module: pgadmin.browser.server_groups.servers.databases.schemas.functions
>> 2018-12-05 17:45:02,779: INFO   pgadmin:        Examining potential module: pgadmin.browser.server_groups.servers.databases.schemas.packages
>> 2018-12-05 17:45:02,779: INFO   pgadmin:        Examining potential module: pgadmin.browser.server_groups.servers.databases.schemas.sequences
>> 2018-12-05 17:45:02,779: INFO   pgadmin:        Examining potential module: pgadmin.browser.server_groups.servers.databases.schemas.synonyms
>> 2018-12-05 17:45:02,779: INFO   pgadmin:        Examining potential module: pgadmin.browser.server_groups.servers.databases.schemas.tables
>> 2018-12-05 17:45:02,779: INFO   pgadmin:        Examining potential module: pgadmin.browser.server_groups.servers.databases.schemas.tests
>> 2018-12-05 17:45:02,780: INFO   pgadmin:        Examining potential module: pgadmin.browser.server_groups.servers.databases.schemas.types
>> 2018-12-05 17:45:02,780: INFO   pgadmin:        Examining potential module: pgadmin.browser.server_groups.servers.databases.schemas.utils
>> 2018-12-05 17:45:02,780: INFO   pgadmin:        Examining potential module: pgadmin.browser.server_groups.servers.databases.schemas.views
>> 2018-12-05 17:45:03,263: INFO   pgadmin:        Examining potential module: pgadmin.browser.server_groups.servers.pgagent.schedules
>> 2018-12-05 17:45:03,266: INFO   pgadmin:        Examining potential module: pgadmin.browser.server_groups.servers.pgagent.steps
>> 2018-12-05 17:45:03,270: INFO   pgadmin:        Examining potential module: pgadmin.browser.server_groups.servers.pgagent.tests
>> 2018-12-05 17:45:03,281: INFO   pgadmin:        Examining potential module: pgadmin.browser.server_groups.servers.resource_groups.tests
>> 2018-12-05 17:45:03,286: INFO   pgadmin:        Examining potential module: pgadmin.browser.server_groups.servers.roles.tests
>> 2018-12-05 17:45:03,292: INFO   pgadmin:        Examining potential module: pgadmin.browser.server_groups.servers.tablespaces.tests
>> 2018-12-05 17:45:03,298: INFO   pgadmin:        Examining potential module: pgadmin.dashboard
>> 2018-12-05 17:45:03,301: INFO   pgadmin:        Registering blueprint module: <pgadmin.dashboard.DashboardModule object at 0x7f5ef2c03890>
>> 2018-12-05 17:45:03,301: INFO   pgadmin:        Examining potential module: pgadmin.dashboard.tests
>> 2018-12-05 17:45:03,310: INFO   pgadmin:        Examining potential module: pgadmin.feature_tests
>> 2018-12-05 17:45:03,310: INFO   pgadmin:        Examining potential module: pgadmin.help
>> 2018-12-05 17:45:03,311: INFO   pgadmin:        Registering blueprint module: <pgadmin.help.HelpModule object at 0x7f5ef2c61d50>
>> 2018-12-05 17:45:03,311: INFO   pgadmin:        Examining potential module: pgadmin.misc
>> 2018-12-05 17:45:03,312: INFO   pgadmin:        Registering blueprint module: <pgadmin.misc.MiscModule object at 0x7f5ef2c0b310>
>> 2018-12-05 17:45:03,313: INFO   pgadmin:        Examining potential module: pgadmin.misc.bgprocess
>> 2018-12-05 17:45:03,337: INFO   pgadmin:        Examining potential module: pgadmin.misc.depends
>> 2018-12-05 17:45:03,338: INFO   pgadmin:        Examining potential module: pgadmin.misc.file_manager
>> 2018-12-05 17:45:03,346: INFO   pgadmin:        Examining potential module: pgadmin.misc.sql
>> 2018-12-05 17:45:03,346: INFO   pgadmin:        Examining potential module: pgadmin.misc.statistics
>> 2018-12-05 17:45:03,348: INFO   pgadmin:        Examining potential module: pgadmin.misc.bgprocess.process_executor
>> 2018-12-05 17:45:03,351: INFO   pgadmin:        Examining potential module: pgadmin.misc.bgprocess.processes
>> 2018-12-05 17:45:03,356: INFO   pgadmin:        Examining potential module: pgadmin.model
>> 2018-12-05 17:45:03,357: INFO   pgadmin:        Examining potential module: pgadmin.preferences
>> 2018-12-05 17:45:03,358: INFO   pgadmin:        Registering blueprint module: <pgadmin.preferences.PreferencesModule object at 0x7f5ef2608e90>
>> 2018-12-05 17:45:03,360: INFO   pgadmin:        Examining potential module: pgadmin.redirects
>> 2018-12-05 17:45:03,360: INFO   pgadmin:        Registering blueprint module: <pgadmin.utils.PgAdminModule object at 0x7f5ef26194d0>
>> 2018-12-05 17:45:03,361: INFO   pgadmin:        Examining potential module: pgadmin.settings
>> 2018-12-05 17:45:03,361: INFO   pgadmin:        Registering blueprint module: <pgadmin.settings.SettingsModule object at 0x7f5ef80b7750>
>> 2018-12-05 17:45:03,363: INFO   pgadmin:        Examining potential module: pgadmin.setup
>> 2018-12-05 17:45:03,364: INFO   pgadmin:        Examining potential module: pgadmin.tools
>> 2018-12-05 17:45:03,364: INFO   pgadmin:        Registering blueprint module: <pgadmin.tools.ToolsModule object at 0x7f5ef2619e50>
>> 2018-12-05 17:45:03,365: INFO   pgadmin:        Examining potential module: pgadmin.tools.backup
>> 2018-12-05 17:45:03,368: INFO   pgadmin:        Examining potential module: pgadmin.tools.datagrid
>> 2018-12-05 17:45:03,433: INFO   pgadmin:        Examining potential module: pgadmin.tools.debugger
>> 2018-12-05 17:45:03,442: INFO   pgadmin:        Examining potential module: pgadmin.tools.grant_wizard
>> 2018-12-05 17:45:03,445: INFO   pgadmin:        Examining potential module: pgadmin.tools.import_export
>> 2018-12-05 17:45:03,447: INFO   pgadmin:        Examining potential module: pgadmin.tools.maintenance
>> 2018-12-05 17:45:03,449: INFO   pgadmin:        Examining potential module: pgadmin.tools.restore
>> 2018-12-05 17:45:03,452: INFO   pgadmin:        Examining potential module: pgadmin.tools.sqleditor
>> 2018-12-05 17:45:03,452: INFO   pgadmin:        Examining potential module: pgadmin.tools.user_management
>> 2018-12-05 17:45:03,455: INFO   pgadmin:        Examining potential module: pgadmin.tools.backup.tests
>> 2018-12-05 17:45:03,470: INFO   pgadmin:        Examining potential module: pgadmin.tools.import_export.tests
>> 2018-12-05 17:45:03,472: INFO   pgadmin:        Examining potential module: pgadmin.tools.maintenance.tests
>> 2018-12-05 17:45:03,473: INFO   pgadmin:        Examining potential module: pgadmin.tools.restore.tests
>> 2018-12-05 17:45:03,475: INFO   pgadmin:        Examining potential module: pgadmin.tools.sqleditor.command
>> 2018-12-05 17:45:03,475: INFO   pgadmin:        Examining potential module: pgadmin.tools.sqleditor.tests
>> 2018-12-05 17:45:03,475: INFO   pgadmin:        Examining potential module: pgadmin.tools.sqleditor.utils
>> 2018-12-05 17:45:03,483: INFO   pgadmin:        Examining potential module: pgadmin.utils
>> NOTE: Configuring authentication for DESKTOP mode.
>> pgAdmin 4 - Application Initialisation
>> ======================================
>>
>> Non-ASCII character '\xc5' in file <https://jenkins.pgadmin.org/job/pgadmin4-master-python27/ws/web/pgadmin/tools/sqleditor/tests/test_encoding_charset.py> on line 59, but no encoding declared; see http://python.org/dev/peps/pep-0263/ for details (test_encoding_charset.py, line 59)
>> ERROR: Error detected when running the Python tests.
>> ERROR: Error detected when running the Python tests.
>> Build step 'Execute shell' marked build as failure
>>


--
Dave Page
Blog: http://pgsnake.blogspot.com
Twitter: @pgsnake

EnterpriseDB UK: http://www.enterprisedb.com
The Enterprise PostgreSQL Company

Reply | Threaded
Open this post in threaded view
|

Build failed in Jenkins: pgadmin4-master-python27 #827

pgAdmin 4 Jenkins
In reply to this post by pgAdmin 4 Jenkins
See <https://jenkins.pgadmin.org/job/pgadmin4-master-python27/827/display/redirect?page=changes>

Changes:

[Dave Page] Fix encoding test for older Python versions.

[Dave Page] Use nullptr instead of NULL or 0.

[Dave Page] Use nullptr instead of NULL or 0.

[Dave Page] Use nullptr instead of NULL or 0.

[Dave Page] Use C++ style casts.

[Dave Page] Use Q_NULLPTR instead of nullptr as some of our older build machines

------------------------------------------
[...truncated 1.03 MB...]
copying images... [ 37%] images/backup_process_watcher.png
copying images... [ 37%] images/foreign_table_constraints.png
copying images... [ 38%] images/type_security.png
copying images... [ 38%] images/fts_dictionary_sql.png
copying images... [ 38%] images/table_unique.png
copying images... [ 39%] images/column_general.png
copying images... [ 39%] images/fts_parser_general.png
copying images... [ 39%] images/function_parameters.png
copying images... [ 40%] images/query_toolbar.png
copying images... [ 40%] images/main_query_tool.png
copying images... [ 40%] images/exclusion_constraint_columns.png
copying images... [ 41%] images/clear_saved_password.png
copying images... [ 41%] images/procedure_general.png
copying images... [ 41%] images/event_trigger_security.png
copying images... [ 41%] images/preferences_paths_binary.png
copying images... [ 42%] images/primary_key_sql.png
copying images... [ 42%] images/foreign_server_definition.png
copying images... [ 42%] images/domain_constraint_sql.png
copying images... [ 43%] images/backup_globals_messages.png
copying images... [ 43%] images/domain_sql.png
copying images... [ 43%] images/backup_objects.png
copying images... [ 44%] images/pgagent_properties.png
copying images... [ 44%] images/query_execute_section.png
copying images... [ 44%] images/foreign_server_sql.png
copying images... [ 45%] images/debug_toolbar.png
copying images... [ 45%] images/query_tool_connection_status.png
copying images... [ 45%] images/preferences_browser_display.png
copying images... [ 46%] images/server_connection.png
copying images... [ 46%] images/server_ssl.png
copying images... [ 46%] images/backup_messages.png
copying images... [ 47%] images/debug_main.png
copying images... [ 47%] images/main_statistics.png
copying images... [ 47%] images/backup_server_do_not_save.png
copying images... [ 48%] images/role_security.png
copying images... [ 48%] images/pgagent_schedules.png
copying images... [ 48%] images/user_mapping_options.png
copying images... [ 49%] images/table_advanced.png
copying images... [ 49%] images/backup_sections.png
copying images... [ 49%] images/restore_messages.png
copying images... [ 50%] images/package_code.png
copying images... [ 50%] images/extension_general.png
copying images... [ 50%] images/maintenance.png
copying images... [ 50%] images/tablespace_definition.png
copying images... [ 51%] images/foreign_data_wrapper_general.png
copying images... [ 51%] images/tool_menu.png
copying images... [ 51%] images/foreign_server_options.png
copying images... [ 52%] images/foreign_key_action.png
copying images... [ 52%] images/schema_security.png
copying images... [ 52%] images/type_external.png
copying images... [ 53%] images/materialized_view_sql.png
copying images... [ 53%] images/import_export_miscellaneous.png
copying images... [ 53%] images/ce_not_running.png
copying images... [ 54%] images/language_sql.png
copying images... [ 54%] images/import_export_options.png
copying images... [ 54%] images/primary_key_definition.png
copying images... [ 55%] images/backup_server_queries.png
copying images... [ 55%] images/rule_sql.png
copying images... [ 55%] images/ce_timeout.png
copying images... [ 56%] images/ce_error_hba.png
copying images... [ 56%] images/connect_to_tunneled_server.png
copying images... [ 56%] images/pgadmin_login.png
copying images... [ 57%] images/main_dashboard.png
copying images... [ 57%] images/backup_miscellaneous.png
copying images... [ 57%] images/import_export_columns.png
copying images... [ 58%] images/grant_wizard_step1.png
copying images... [ 58%] images/preferences_dashboard_graphs.png
copying images... [ 58%] images/preferences_sql_options.png
copying images... [ 58%] images/foreign_key_sql.png
copying images... [ 59%] images/tablespace_general.png
copying images... [ 59%] images/column_variables.png
copying images... [ 59%] images/resource_group_sql.png
copying images... [ 60%] images/ce_password_failed.png
copying images... [ 60%] images/foreign_table_general.png
copying images... [ 60%] images/restore_sections.png
copying images... [ 61%] images/preferences_dashboard_display.png
copying images... [ 61%] images/rule_definition.png
copying images... [ 61%] images/column_security.png
copying images... [ 62%] images/move_objects_sql.png
copying images... [ 62%] images/restore_objects.png
copying images... [ 62%] images/sequence_general.png
copying images... [ 63%] images/geometry_viewer.png
copying images... [ 63%] images/server_ssh_tunnel.png
copying images... [ 63%] images/editgrid_toolbar.png
copying images... [ 64%] images/role_membership.png
copying images... [ 64%] images/rule_general.png
copying images... [ 64%] images/fts_configuration_sql.png
copying images... [ 65%] images/preferences_misc_user_language.png
copying images... [ 65%] images/table_partition.png
copying images... [ 65%] images/language_security.png
copying images... [ 66%] images/extension_sql.png
copying images... [ 66%] images/database_general.png
copying images... [ 66%] images/exclusion_constraint_definition.png
copying images... [ 66%] images/domain_constraint_definition.png
copying images... [ 67%] images/query_output_error.png
copying images... [ 67%] images/restore_disable.png
copying images... [ 67%] images/view_definition.png
copying images... [ 68%] images/fts_dictionary_options.png
copying images... [ 68%] images/foreign_table_security.png
copying images... [ 68%] images/primary_key_general.png
copying images... [ 69%] images/extension_definition.png
copying images... [ 69%] images/tablespace_sql.png
copying images... [ 69%] images/procedure_arguments.png
copying images... [ 70%] images/object_menu.png
copying images... [ 70%] images/index_general.png
copying images... [ 70%] images/foreign_table_columns.png
copying images... [ 71%] images/index_definition.png
copying images... [ 71%] images/server_general.png
copying images... [ 71%] images/fts_dictionary_general.png
copying images... [ 72%] images/pgagent_sql.png
copying images... [ 72%] images/main_properties_icons.png
copying images... [ 72%] images/foreign_data_wrapper_definition.png
copying images... [ 73%] images/role_definition.png
copying images... [ 73%] images/procedure_security.png
copying images... [ 73%] images/fts_dictionary_definition.png
copying images... [ 74%] images/fts_template_definition.png
copying images... [ 74%] images/table_exclude.png
copying images... [ 74%] images/clear_tunnel_password.png
copying images... [ 75%] images/cast_definition.png
copying images... [ 75%] images/user_mapping_general.png
copying images... [ 75%] images/table_constraints.png
copying images... [ 75%] images/backup_server_general.png
copying images... [ 76%] images/collation_sql.png
copying images... [ 76%] images/foreign_table_options.png
copying images... [ 76%] images/add_pgadmin_user.png
copying images... [ 77%] images/language_definition.png
copying images... [ 77%] images/pgagent_schedule_definition.png
copying images... [ 77%] images/foreign_key_general.png
copying images... [ 78%] images/table_sql.png
copying images... [ 78%] images/check_definition.png
copying images... [ 78%] images/function_options.png
copying images... [ 79%] images/pgadmin_login_recover.png
copying images... [ 79%] images/type_shell.png
copying images... [ 79%] images/tablespace_parameters.png
copying images... [ 80%] images/change_user_password.png
copying images... [ 80%] images/view_security.png
copying images... [ 80%] images/type_range.png
copying images... [ 81%] images/import_export_complete.png
copying images... [ 81%] images/connect_to_server.png
copying images... [ 81%] images/main_dependencies.png
copying images... [ 82%] images/column_sql.png
copying images... [ 82%] images/tablespace_security.png
copying images... [ 82%] images/backup_queries.png
copying images... [ 83%] images/backup_globals_process_watcher.png
copying images... [ 83%] images/unique_constraint_definition.png
copying images... [ 83%] images/exclusion_constraint_sql.png
copying images... [ 83%] images/logo-right-128.png
copying images... [ 84%] images/geometry_viewer_property_table.png
copying images... [ 84%] images/table_parameter.png
copying images... [ 84%] images/fts_parser_sql.png
copying images... [ 85%] images/debug_stack.png
copying images... [ 85%] images/trigger_function_options.png
copying images... [ 85%] images/database_security.png
copying images... [ 86%] images/domain_general.png
copying images... [ 86%] images/exclusion_constraint_general.png
copying images... [ 86%] images/schema_sql.png
copying images... [ 87%] images/debug_ic_step_in.png
copying images... [ 87%] images/maintenance_complete.png
copying images... [ 87%] images/foreign_table_definition.png
copying images... [ 88%] images/domain_constraint_general.png
copying images... [ 88%] images/debug_step_in.png
copying images... [ 88%] images/preferences_storage_options.png
copying images... [ 89%] images/pgadmin_welcome.png
copying images... [ 89%] images/materialized_view_definition.png
copying images... [ 89%] images/function_definition.png
copying images... [ 90%] images/pgagent_step_definition_code.png
copying images... [ 90%] images/cast_general.png
copying images... [ 90%] images/unique_constraint_general.png
copying images... [ 91%] images/foreign_data_wrapper_options.png
copying images... [ 91%] images/query_tool.png
copying images... [ 91%] images/query_output_data.png
copying images... [ 91%] images/query_output_history.png
copying images... [ 92%] images/database_definition.png
copying images... [ 92%] images/role_privileges.png
copying images... [ 92%] images/preferences_sql_auto_completion.png
copying images... [ 93%] images/help_menu.png
copying images... [ 93%] images/sequence_sql.png
copying images... [ 93%] images/query_tool_message.png
copying images... [ 94%] images/backup_server_disable.png
copying images... [ 94%] images/query_sql_editor.png
copying images... [ 94%] images/preferences_sql_explain.png
copying images... [ 95%] images/query_output_explain.png
copying images... [ 95%] images/unique_constraint_sql.png
copying images... [ 95%] images/add_restore_point.png
copying images... [ 96%] images/fts_configuration_tokens.png
copying images... [ 96%] images/pgadmin_user.png
copying images... [ 96%] images/event_trigger_sql.png
copying images... [ 97%] images/backup_globals_general.png
copying images... [ 97%] images/preferences_debugger_display.png
copying images... [ 97%] images/preferences_browser_properties.png
copying images... [ 98%] images/type_sql.png
copying images... [ 98%] images/procedure_definition.png
copying images... [ 98%] images/package_general.png
copying images... [ 99%] images/file_menu.png
copying images... [ 99%] images/grant_wizard_step2.png
copying images... [ 99%] images/column_definition.png
copying images... [100%] images/backup_server_miscellaneous.png

copying static files... done
copying extra files... done
dumping search index in English (code: en) ... done
dumping object inventory... done
build succeeded.

The HTML pages are in _build/html.

Build finished. The HTML pages are in _build/html.
make[1]: Leaving directory `<https://jenkins.pgadmin.org/job/pgadmin4-master-python27/ws/docs/en_US'>
EXECUTING: Build runtime - QT4

make: *** No rule to make target `clean'.  Stop.
Project MESSAGE: Building for QT4...
Project MESSAGE: Building for Linux/Mac...
Project MESSAGE: Using /usr/local/python-2.7/bin/python-config
Project MESSAGE: Python2 detected.
/usr/lib64/qt4/bin/uic ConfigWindow.ui -o ui_ConfigWindow.h
/usr/lib64/qt4/bin/uic LogWindow.ui -o ui_LogWindow.h
/usr/lib64/qt4/bin/uic FloatingWindow.ui -o ui_FloatingWindow.h
g++ -c -pipe -I/usr/local/python-2.7/include/python2.7 -I/usr/local/python-2.7/include/python2.7 -O2 -g -pipe -Wall -Wp,-D_FORTIFY_SOURCE=2 -fexceptions -fstack-protector-strong --param=ssp-buffer-size=4 -grecord-gcc-switches -m64 -mtune=generic -O2 -Wall -W -D_REENTRANT -DPYTHON2 -DQT_NO_DEBUG -DQT_GUI_LIB -DQT_NETWORK_LIB -DQT_CORE_LIB -DQT_SHARED -I/usr/lib64/qt4/mkspecs/linux-g++ -I. -I/usr/include/QtCore -I/usr/include/QtNetwork -I/usr/include/QtGui -I/usr/include -I. -I. -o pgAdmin4.o pgAdmin4.cpp
In file included from pgAdmin4.cpp:34:0:
ConfigWindow.h:26:45: error: ‘Q_NULLPTR’ was not declared in this scope
     explicit ConfigWindow(QWidget *parent = Q_NULLPTR);
                                             ^
In file included from MenuActions.h:18:0,
                 from TrayIcon.h:19,
                 from pgAdmin4.cpp:36:
LogWindow.h:26:42: error: ‘Q_NULLPTR’ was not declared in this scope
     explicit LogWindow(QWidget *parent = Q_NULLPTR, QString logFile = "");
                                          ^
In file included from pgAdmin4.cpp:38:0:
FloatingWindow.h:30:47: error: ‘Q_NULLPTR’ was not declared in this scope
     explicit FloatingWindow(QWidget *parent = Q_NULLPTR);
                                               ^
pgAdmin4.cpp: In function ‘int main(int, char**)’:
pgAdmin4.cpp:217:23: error: ‘Q_NULLPTR’ was not declared in this scope
     if(menuActions != Q_NULLPTR)
                       ^
pgAdmin4.cpp:224:38: error: ‘Q_NULLPTR’ was not declared in this scope
     FloatingWindow *floatingWindow = Q_NULLPTR;
                                      ^
pgAdmin4.cpp:242:45: error: call to ‘FloatingWindow::FloatingWindow(QWidget*)’ uses the default argument for parameter 1, which is not yet defined
         floatingWindow = new FloatingWindow();
                                             ^
pgAdmin4.cpp:311:50: error: call to ‘ConfigWindow::ConfigWindow(QWidget*)’ uses the default argument for parameter 1, which is not yet defined
             ConfigWindow *dlg = new ConfigWindow();
                                                  ^
make: *** [pgAdmin4.o] Error 1
ERROR: Failed to build the QT4 runtime.
ERROR: Failed to build the QT4 runtime.
Build step 'Execute shell' marked build as failure

Reply | Threaded
Open this post in threaded view
|

Jenkins build is back to normal : pgadmin4-master-python27 #828

pgAdmin 4 Jenkins