Build failed in Jenkins: pgadmin4-master-python27 #862

classic Classic list List threaded Threaded
3 messages Options
Reply | Threaded
Open this post in threaded view
|

Build failed in Jenkins: pgadmin4-master-python27 #862

pgAdmin 4 Jenkins
See <https://jenkins.pgadmin.org/job/pgadmin4-master-python27/862/display/redirect?page=changes>

Changes:

[Dave Page] Fix help for the backup/restore dialogues. Fixes #3861

------------------------------------------
[...truncated 1014.87 KB...]
HeadlessChrome 0.0.0 (Linux 0.0.0): Executed 519 of 763 (4 FAILED) (0 secs / 9.444 secs)
HeadlessChrome 0.0.0 (Linux 0.0.0): Executed 520 of 763 (4 FAILED) (0 secs / 9.446 secs)
HeadlessChrome 0.0.0 (Linux 0.0.0): Executed 521 of 763 (4 FAILED) (0 secs / 9.449 secs)
HeadlessChrome 0.0.0 (Linux 0.0.0): Executed 522 of 763 (4 FAILED) (0 secs / 9.457 secs)
HeadlessChrome 0.0.0 (Linux 0.0.0): Executed 523 of 763 (4 FAILED) (0 secs / 9.461 secs)
HeadlessChrome 0.0.0 (Linux 0.0.0): Executed 524 of 763 (4 FAILED) (0 secs / 9.464 secs)
HeadlessChrome 0.0.0 (Linux 0.0.0): Executed 525 of 763 (4 FAILED) (0 secs / 9.467 secs)
HeadlessChrome 0.0.0 (Linux 0.0.0): Executed 526 of 763 (4 FAILED) (0 secs / 9.475 secs)
HeadlessChrome 0.0.0 (Linux 0.0.0): Executed 527 of 763 (4 FAILED) (0 secs / 9.478 secs)
HeadlessChrome 0.0.0 (Linux 0.0.0): Executed 528 of 763 (4 FAILED) (0 secs / 9.481 secs)
HeadlessChrome 0.0.0 (Linux 0.0.0): Executed 529 of 763 (4 FAILED) (0 secs / 9.484 secs)
HeadlessChrome 0.0.0 (Linux 0.0.0): Executed 530 of 763 (4 FAILED) (0 secs / 9.486 secs)
HeadlessChrome 0.0.0 (Linux 0.0.0): Executed 531 of 763 (4 FAILED) (0 secs / 9.49 secs)
HeadlessChrome 0.0.0 (Linux 0.0.0): Executed 532 of 763 (4 FAILED) (0 secs / 9.493 secs)
HeadlessChrome 0.0.0 (Linux 0.0.0): Executed 533 of 763 (4 FAILED) (0 secs / 9.496 secs)
HeadlessChrome 0.0.0 (Linux 0.0.0): Executed 534 of 763 (4 FAILED) (0 secs / 9.501 secs)
HeadlessChrome 0.0.0 (Linux 0.0.0): Executed 535 of 763 (4 FAILED) (0 secs / 9.51 secs)
HeadlessChrome 0.0.0 (Linux 0.0.0): Executed 536 of 763 (4 FAILED) (0 secs / 9.514 secs)
HeadlessChrome 0.0.0 (Linux 0.0.0): Executed 537 of 763 (4 FAILED) (0 secs / 9.518 secs)
HeadlessChrome 0.0.0 (Linux 0.0.0): Executed 538 of 763 (4 FAILED) (0 secs / 9.523 secs)
HeadlessChrome 0.0.0 (Linux 0.0.0): Executed 539 of 763 (4 FAILED) (0 secs / 9.527 secs)
HeadlessChrome 0.0.0 (Linux 0.0.0): Executed 540 of 763 (4 FAILED) (0 secs / 9.53 secs)
HeadlessChrome 0.0.0 (Linux 0.0.0): Executed 541 of 763 (4 FAILED) (0 secs / 9.534 secs)
HeadlessChrome 0.0.0 (Linux 0.0.0): Executed 542 of 763 (4 FAILED) (0 secs / 9.576 secs)
HeadlessChrome 0.0.0 (Linux 0.0.0): Executed 543 of 763 (4 FAILED) (0 secs / 9.586 secs)
HeadlessChrome 0.0.0 (Linux 0.0.0): Executed 544 of 763 (4 FAILED) (0 secs / 9.591 secs)
HeadlessChrome 0.0.0 (Linux 0.0.0): Executed 545 of 763 (4 FAILED) (0 secs / 9.596 secs)
HeadlessChrome 0.0.0 (Linux 0.0.0): Executed 546 of 763 (4 FAILED) (0 secs / 9.599 secs)
HeadlessChrome 0.0.0 (Linux 0.0.0): Executed 547 of 763 (4 FAILED) (0 secs / 9.606 secs)
HeadlessChrome 0.0.0 (Linux 0.0.0): Executed 548 of 763 (4 FAILED) (0 secs / 9.609 secs)
HeadlessChrome 0.0.0 (Linux 0.0.0): Executed 549 of 763 (4 FAILED) (0 secs / 9.614 secs)
HeadlessChrome 0.0.0 (Linux 0.0.0): Executed 550 of 763 (4 FAILED) (0 secs / 9.621 secs)
HeadlessChrome 0.0.0 (Linux 0.0.0): Executed 551 of 763 (4 FAILED) (0 secs / 9.625 secs)
HeadlessChrome 0.0.0 (Linux 0.0.0): Executed 552 of 763 (4 FAILED) (0 secs / 9.628 secs)
HeadlessChrome 0.0.0 (Linux 0.0.0): Executed 553 of 763 (4 FAILED) (0 secs / 9.631 secs)
HeadlessChrome 0.0.0 (Linux 0.0.0): Executed 554 of 763 (4 FAILED) (0 secs / 9.637 secs)
HeadlessChrome 0.0.0 (Linux 0.0.0): Executed 555 of 763 (4 FAILED) (0 secs / 9.64 secs)
HeadlessChrome 0.0.0 (Linux 0.0.0): Executed 556 of 763 (4 FAILED) (0 secs / 9.642 secs)
HeadlessChrome 0.0.0 (Linux 0.0.0): Executed 557 of 763 (4 FAILED) (0 secs / 9.645 secs)
HeadlessChrome 0.0.0 (Linux 0.0.0): Executed 558 of 763 (4 FAILED) (0 secs / 9.651 secs)
HeadlessChrome 0.0.0 (Linux 0.0.0): Executed 559 of 763 (4 FAILED) (0 secs / 9.655 secs)
HeadlessChrome 0.0.0 (Linux 0.0.0): Executed 560 of 763 (4 FAILED) (0 secs / 9.658 secs)
HeadlessChrome 0.0.0 (Linux 0.0.0): Executed 561 of 763 (4 FAILED) (0 secs / 9.663 secs)
HeadlessChrome 0.0.0 (Linux 0.0.0): Executed 562 of 763 (4 FAILED) (0 secs / 9.667 secs)
HeadlessChrome 0.0.0 (Linux 0.0.0): Executed 563 of 763 (4 FAILED) (0 secs / 9.67 secs)
HeadlessChrome 0.0.0 (Linux 0.0.0): Executed 564 of 763 (4 FAILED) (0 secs / 9.674 secs)
HeadlessChrome 0.0.0 (Linux 0.0.0): Executed 565 of 763 (4 FAILED) (0 secs / 9.678 secs)
HeadlessChrome 0.0.0 (Linux 0.0.0): Executed 566 of 763 (4 FAILED) (0 secs / 9.684 secs)
HeadlessChrome 0.0.0 (Linux 0.0.0): Executed 567 of 763 (4 FAILED) (0 secs / 9.69 secs)
HeadlessChrome 0.0.0 (Linux 0.0.0): Executed 568 of 763 (4 FAILED) (0 secs / 9.693 secs)
HeadlessChrome 0.0.0 (Linux 0.0.0): Executed 569 of 763 (4 FAILED) (0 secs / 9.696 secs)
HeadlessChrome 0.0.0 (Linux 0.0.0): Executed 570 of 763 (4 FAILED) (0 secs / 9.701 secs)
HeadlessChrome 0.0.0 (Linux 0.0.0): Executed 571 of 763 (4 FAILED) (0 secs / 9.706 secs)
HeadlessChrome 0.0.0 (Linux 0.0.0): Executed 572 of 763 (4 FAILED) (0 secs / 9.709 secs)
HeadlessChrome 0.0.0 (Linux 0.0.0): Executed 573 of 763 (4 FAILED) (0 secs / 9.713 secs)
HeadlessChrome 0.0.0 (Linux 0.0.0): Executed 574 of 763 (4 FAILED) (0 secs / 9.719 secs)
HeadlessChrome 0.0.0 (Linux 0.0.0): Executed 575 of 763 (4 FAILED) (0 secs / 9.722 secs)
HeadlessChrome 0.0.0 (Linux 0.0.0): Executed 576 of 763 (4 FAILED) (0 secs / 9.725 secs)
HeadlessChrome 0.0.0 (Linux 0.0.0): Executed 577 of 763 (4 FAILED) (0 secs / 9.727 secs)
HeadlessChrome 0.0.0 (Linux 0.0.0): Executed 578 of 763 (4 FAILED) (0 secs / 9.729 secs)
HeadlessChrome 0.0.0 (Linux 0.0.0): Executed 579 of 763 (4 FAILED) (0 secs / 9.733 secs)
HeadlessChrome 0.0.0 (Linux 0.0.0): Executed 580 of 763 (4 FAILED) (0 secs / 9.734 secs)
HeadlessChrome 0.0.0 (Linux 0.0.0): Executed 581 of 763 (4 FAILED) (0 secs / 9.736 secs)
HeadlessChrome 0.0.0 (Linux 0.0.0): Executed 582 of 763 (4 FAILED) (0 secs / 9.738 secs)
HeadlessChrome 0.0.0 (Linux 0.0.0): Executed 583 of 763 (4 FAILED) (0 secs / 9.739 secs)
HeadlessChrome 0.0.0 (Linux 0.0.0): Executed 584 of 763 (4 FAILED) (0 secs / 9.74 secs)
HeadlessChrome 0.0.0 (Linux 0.0.0): Executed 585 of 763 (4 FAILED) (0 secs / 9.745 secs)
HeadlessChrome 0.0.0 (Linux 0.0.0): Executed 586 of 763 (4 FAILED) (0 secs / 9.748 secs)
HeadlessChrome 0.0.0 (Linux 0.0.0): Executed 587 of 763 (4 FAILED) (0 secs / 9.749 secs)
HeadlessChrome 0.0.0 (Linux 0.0.0): Executed 588 of 763 (4 FAILED) (0 secs / 9.751 secs)
HeadlessChrome 0.0.0 (Linux 0.0.0): Executed 589 of 763 (4 FAILED) (0 secs / 9.752 secs)
HeadlessChrome 0.0.0 (Linux 0.0.0): Executed 590 of 763 (4 FAILED) (0 secs / 9.755 secs)
HeadlessChrome 0.0.0 (Linux 0.0.0): Executed 591 of 763 (4 FAILED) (0 secs / 9.758 secs)
HeadlessChrome 0.0.0 (Linux 0.0.0): Executed 592 of 763 (4 FAILED) (0 secs / 9.759 secs)
HeadlessChrome 0.0.0 (Linux 0.0.0): Executed 593 of 763 (4 FAILED) (0 secs / 9.761 secs)
HeadlessChrome 0.0.0 (Linux 0.0.0): Executed 594 of 763 (4 FAILED) (0 secs / 9.762 secs)
HeadlessChrome 0.0.0 (Linux 0.0.0): Executed 595 of 763 (4 FAILED) (0 secs / 9.764 secs)
HeadlessChrome 0.0.0 (Linux 0.0.0): Executed 596 of 763 (4 FAILED) (0 secs / 9.765 secs)
HeadlessChrome 0.0.0 (Linux 0.0.0): Executed 597 of 763 (4 FAILED) (0 secs / 9.767 secs)
HeadlessChrome 0.0.0 (Linux 0.0.0): Executed 598 of 763 (4 FAILED) (0 secs / 9.769 secs)
HeadlessChrome 0.0.0 (Linux 0.0.0): Executed 599 of 763 (4 FAILED) (0 secs / 9.772 secs)
HeadlessChrome 0.0.0 (Linux 0.0.0): Executed 600 of 763 (4 FAILED) (0 secs / 9.774 secs)
HeadlessChrome 0.0.0 (Linux 0.0.0): Executed 601 of 763 (4 FAILED) (0 secs / 9.777 secs)
HeadlessChrome 0.0.0 (Linux 0.0.0): Executed 602 of 763 (4 FAILED) (0 secs / 9.78 secs)
HeadlessChrome 0.0.0 (Linux 0.0.0): Executed 603 of 763 (4 FAILED) (0 secs / 9.781 secs)
HeadlessChrome 0.0.0 (Linux 0.0.0): Executed 604 of 763 (4 FAILED) (0 secs / 9.783 secs)
HeadlessChrome 0.0.0 (Linux 0.0.0): Executed 605 of 763 (4 FAILED) (0 secs / 9.784 secs)
HeadlessChrome 0.0.0 (Linux 0.0.0): Executed 606 of 763 (4 FAILED) (0 secs / 9.787 secs)
HeadlessChrome 0.0.0 (Linux 0.0.0): Executed 607 of 763 (4 FAILED) (0 secs / 9.788 secs)
HeadlessChrome 0.0.0 (Linux 0.0.0): Executed 608 of 763 (4 FAILED) (0 secs / 9.789 secs)
HeadlessChrome 0.0.0 (Linux 0.0.0): Executed 609 of 763 (4 FAILED) (0 secs / 9.791 secs)
HeadlessChrome 0.0.0 (Linux 0.0.0): Executed 610 of 763 (4 FAILED) (0 secs / 9.793 secs)
HeadlessChrome 0.0.0 (Linux 0.0.0): Executed 611 of 763 (4 FAILED) (0 secs / 9.794 secs)
HeadlessChrome 0.0.0 (Linux 0.0.0): Executed 612 of 763 (4 FAILED) (0 secs / 9.797 secs)
HeadlessChrome 0.0.0 (Linux 0.0.0): Executed 613 of 763 (4 FAILED) (0 secs / 9.801 secs)
HeadlessChrome 0.0.0 (Linux 0.0.0): Executed 614 of 763 (4 FAILED) (0 secs / 9.803 secs)
HeadlessChrome 0.0.0 (Linux 0.0.0): Executed 615 of 763 (4 FAILED) (0 secs / 9.803 secs)
HeadlessChrome 0.0.0 (Linux 0.0.0): Executed 616 of 763 (4 FAILED) (0 secs / 9.805 secs)
HeadlessChrome 0.0.0 (Linux 0.0.0): Executed 617 of 763 (4 FAILED) (0 secs / 9.807 secs)
HeadlessChrome 0.0.0 (Linux 0.0.0): Executed 618 of 763 (4 FAILED) (0 secs / 9.808 secs)
HeadlessChrome 0.0.0 (Linux 0.0.0): Executed 619 of 763 (4 FAILED) (0 secs / 9.809 secs)
HeadlessChrome 0.0.0 (Linux 0.0.0): Executed 620 of 763 (4 FAILED) (0 secs / 9.811 secs)
HeadlessChrome 0.0.0 (Linux 0.0.0): Executed 621 of 763 (4 FAILED) (0 secs / 9.814 secs)
HeadlessChrome 0.0.0 (Linux 0.0.0): Executed 622 of 763 (4 FAILED) (0 secs / 9.815 secs)
HeadlessChrome 0.0.0 (Linux 0.0.0): Executed 623 of 763 (4 FAILED) (0 secs / 9.817 secs)
HeadlessChrome 0.0.0 (Linux 0.0.0): Executed 624 of 763 (4 FAILED) (0 secs / 9.819 secs)
HeadlessChrome 0.0.0 (Linux 0.0.0): Executed 625 of 763 (4 FAILED) (0 secs / 9.821 secs)
HeadlessChrome 0.0.0 (Linux 0.0.0): Executed 626 of 763 (4 FAILED) (0 secs / 9.823 secs)
HeadlessChrome 0.0.0 (Linux 0.0.0): Executed 627 of 763 (4 FAILED) (0 secs / 9.825 secs)
HeadlessChrome 0.0.0 (Linux 0.0.0): Executed 628 of 763 (4 FAILED) (0 secs / 9.83 secs)
HeadlessChrome 0.0.0 (Linux 0.0.0): Executed 629 of 763 (4 FAILED) (0 secs / 9.832 secs)
HeadlessChrome 0.0.0 (Linux 0.0.0): Executed 630 of 763 (4 FAILED) (0 secs / 9.834 secs)
HeadlessChrome 0.0.0 (Linux 0.0.0): Executed 631 of 763 (4 FAILED) (0 secs / 9.835 secs)
HeadlessChrome 0.0.0 (Linux 0.0.0): Executed 632 of 763 (4 FAILED) (0 secs / 9.837 secs)
HeadlessChrome 0.0.0 (Linux 0.0.0): Executed 633 of 763 (4 FAILED) (0 secs / 9.838 secs)
HeadlessChrome 0.0.0 (Linux 0.0.0): Executed 634 of 763 (4 FAILED) (0 secs / 9.84 secs)
HeadlessChrome 0.0.0 (Linux 0.0.0): Executed 635 of 763 (4 FAILED) (0 secs / 9.845 secs)
HeadlessChrome 0.0.0 (Linux 0.0.0): Executed 636 of 763 (4 FAILED) (0 secs / 9.854 secs)
HeadlessChrome 0.0.0 (Linux 0.0.0): Executed 637 of 763 (4 FAILED) (0 secs / 9.856 secs)
HeadlessChrome 0.0.0 (Linux 0.0.0): Executed 638 of 763 (4 FAILED) (0 secs / 9.86 secs)
HeadlessChrome 0.0.0 (Linux 0.0.0): Executed 639 of 763 (4 FAILED) (0 secs / 9.862 secs)
HeadlessChrome 0.0.0 (Linux 0.0.0): Executed 640 of 763 (4 FAILED) (0 secs / 9.863 secs)
HeadlessChrome 0.0.0 (Linux 0.0.0): Executed 641 of 763 (4 FAILED) (0 secs / 9.866 secs)
HeadlessChrome 0.0.0 (Linux 0.0.0): Executed 642 of 763 (4 FAILED) (0 secs / 9.868 secs)
HeadlessChrome 0.0.0 (Linux 0.0.0): Executed 643 of 763 (4 FAILED) (0 secs / 9.87 secs)
HeadlessChrome 0.0.0 (Linux 0.0.0): Executed 644 of 763 (4 FAILED) (0 secs / 9.874 secs)
HeadlessChrome 0.0.0 (Linux 0.0.0): Executed 645 of 763 (4 FAILED) (0 secs / 9.877 secs)
HeadlessChrome 0.0.0 (Linux 0.0.0): Executed 646 of 763 (4 FAILED) (0 secs / 9.879 secs)
HeadlessChrome 0.0.0 (Linux 0.0.0): Executed 647 of 763 (4 FAILED) (0 secs / 9.88 secs)
HeadlessChrome 0.0.0 (Linux 0.0.0): Executed 648 of 763 (4 FAILED) (0 secs / 9.881 secs)
HeadlessChrome 0.0.0 (Linux 0.0.0): Executed 649 of 763 (4 FAILED) (0 secs / 9.883 secs)
HeadlessChrome 0.0.0 (Linux 0.0.0): Executed 650 of 763 (4 FAILED) (0 secs / 9.885 secs)
HeadlessChrome 0.0.0 (Linux 0.0.0): Executed 651 of 763 (4 FAILED) (0 secs / 9.889 secs)
HeadlessChrome 0.0.0 (Linux 0.0.0): Executed 652 of 763 (4 FAILED) (0 secs / 9.891 secs)
HeadlessChrome 0.0.0 (Linux 0.0.0): Executed 653 of 763 (4 FAILED) (0 secs / 9.893 secs)
HeadlessChrome 0.0.0 (Linux 0.0.0): Executed 654 of 763 (4 FAILED) (0 secs / 9.895 secs)
HeadlessChrome 0.0.0 (Linux 0.0.0): Executed 655 of 763 (4 FAILED) (0 secs / 9.897 secs)
HeadlessChrome 0.0.0 (Linux 0.0.0): Executed 656 of 763 (4 FAILED) (0 secs / 9.899 secs)
HeadlessChrome 0.0.0 (Linux 0.0.0): Executed 657 of 763 (4 FAILED) (0 secs / 9.901 secs)
HeadlessChrome 0.0.0 (Linux 0.0.0): Executed 658 of 763 (4 FAILED) (0 secs / 9.904 secs)
HeadlessChrome 0.0.0 (Linux 0.0.0): Executed 659 of 763 (4 FAILED) (0 secs / 9.906 secs)
HeadlessChrome 0.0.0 (Linux 0.0.0): Executed 660 of 763 (4 FAILED) (0 secs / 9.908 secs)
HeadlessChrome 0.0.0 (Linux 0.0.0): Executed 661 of 763 (4 FAILED) (0 secs / 9.91 secs)
HeadlessChrome 0.0.0 (Linux 0.0.0): Executed 662 of 763 (4 FAILED) (0 secs / 9.911 secs)
HeadlessChrome 0.0.0 (Linux 0.0.0): Executed 663 of 763 (4 FAILED) (0 secs / 9.912 secs)
HeadlessChrome 0.0.0 (Linux 0.0.0): Executed 664 of 763 (4 FAILED) (0 secs / 9.913 secs)
HeadlessChrome 0.0.0 (Linux 0.0.0): Executed 665 of 763 (4 FAILED) (0 secs / 9.917 secs)
HeadlessChrome 0.0.0 (Linux 0.0.0): Executed 666 of 763 (4 FAILED) (0 secs / 9.919 secs)
HeadlessChrome 0.0.0 (Linux 0.0.0): Executed 667 of 763 (4 FAILED) (0 secs / 9.92 secs)
HeadlessChrome 0.0.0 (Linux 0.0.0): Executed 668 of 763 (4 FAILED) (0 secs / 9.922 secs)
HeadlessChrome 0.0.0 (Linux 0.0.0): Executed 669 of 763 (4 FAILED) (0 secs / 9.922 secs)
HeadlessChrome 0.0.0 (Linux 0.0.0): Executed 670 of 763 (4 FAILED) (0 secs / 9.924 secs)
HeadlessChrome 0.0.0 (Linux 0.0.0): Executed 671 of 763 (4 FAILED) (0 secs / 9.926 secs)
HeadlessChrome 0.0.0 (Linux 0.0.0): Executed 672 of 763 (4 FAILED) (0 secs / 9.927 secs)
HeadlessChrome 0.0.0 (Linux 0.0.0): Executed 673 of 763 (4 FAILED) (0 secs / 9.929 secs)
HeadlessChrome 0.0.0 (Linux 0.0.0): Executed 674 of 763 (4 FAILED) (0 secs / 9.93 secs)
HeadlessChrome 0.0.0 (Linux 0.0.0): Executed 675 of 763 (4 FAILED) (0 secs / 9.932 secs)
HeadlessChrome 0.0.0 (Linux 0.0.0): Executed 676 of 763 (4 FAILED) (0 secs / 9.935 secs)
HeadlessChrome 0.0.0 (Linux 0.0.0): Executed 677 of 763 (4 FAILED) (0 secs / 9.94 secs)
HeadlessChrome 0.0.0 (Linux 0.0.0): Executed 678 of 763 (4 FAILED) (0 secs / 9.944 secs)
HeadlessChrome 0.0.0 (Linux 0.0.0): Executed 679 of 763 (4 FAILED) (0 secs / 9.948 secs)
HeadlessChrome 0.0.0 (Linux 0.0.0): Executed 680 of 763 (4 FAILED) (0 secs / 9.97 secs)
HeadlessChrome 0.0.0 (Linux 0.0.0): Executed 681 of 763 (4 FAILED) (0 secs / 9.975 secs)
HeadlessChrome 0.0.0 (Linux 0.0.0): Executed 682 of 763 (4 FAILED) (0 secs / 9.978 secs)
HeadlessChrome 0.0.0 (Linux 0.0.0): Executed 683 of 763 (4 FAILED) (0 secs / 10 secs)
HeadlessChrome 0.0.0 (Linux 0.0.0): Executed 684 of 763 (4 FAILED) (0 secs / 10.003 secs)
HeadlessChrome 0.0.0 (Linux 0.0.0): Executed 685 of 763 (4 FAILED) (0 secs / 10.006 secs)
HeadlessChrome 0.0.0 (Linux 0.0.0): Executed 686 of 763 (4 FAILED) (0 secs / 10.009 secs)
HeadlessChrome 0.0.0 (Linux 0.0.0): Executed 687 of 763 (4 FAILED) (0 secs / 10.03 secs)
HeadlessChrome 0.0.0 (Linux 0.0.0): Executed 688 of 763 (4 FAILED) (0 secs / 10.034 secs)
HeadlessChrome 0.0.0 (Linux 0.0.0): Executed 689 of 763 (4 FAILED) (0 secs / 10.038 secs)
HeadlessChrome 0.0.0 (Linux 0.0.0): Executed 690 of 763 (4 FAILED) (0 secs / 10.06 secs)
HeadlessChrome 0.0.0 (Linux 0.0.0): Executed 691 of 763 (4 FAILED) (0 secs / 10.063 secs)
HeadlessChrome 0.0.0 (Linux 0.0.0): Executed 692 of 763 (4 FAILED) (0 secs / 10.066 secs)
HeadlessChrome 0.0.0 (Linux 0.0.0): Executed 693 of 763 (4 FAILED) (0 secs / 10.07 secs)
HeadlessChrome 0.0.0 (Linux 0.0.0): Executed 694 of 763 (4 FAILED) (0 secs / 10.072 secs)
HeadlessChrome 0.0.0 (Linux 0.0.0): Executed 695 of 763 (4 FAILED) (0 secs / 10.075 secs)
HeadlessChrome 0.0.0 (Linux 0.0.0): Executed 696 of 763 (4 FAILED) (0 secs / 10.078 secs)
HeadlessChrome 0.0.0 (Linux 0.0.0): Executed 697 of 763 (4 FAILED) (0 secs / 10.079 secs)
HeadlessChrome 0.0.0 (Linux 0.0.0): Executed 698 of 763 (4 FAILED) (0 secs / 10.082 secs)
HeadlessChrome 0.0.0 (Linux 0.0.0): Executed 699 of 763 (4 FAILED) (0 secs / 10.084 secs)
HeadlessChrome 0.0.0 (Linux 0.0.0): Executed 700 of 763 (4 FAILED) (0 secs / 10.086 secs)
HeadlessChrome 0.0.0 (Linux 0.0.0): Executed 701 of 763 (4 FAILED) (0 secs / 10.087 secs)
HeadlessChrome 0.0.0 (Linux 0.0.0): Executed 702 of 763 (4 FAILED) (0 secs / 10.088 secs)
HeadlessChrome 0.0.0 (Linux 0.0.0): Executed 703 of 763 (4 FAILED) (0 secs / 10.091 secs)
HeadlessChrome 0.0.0 (Linux 0.0.0): Executed 704 of 763 (4 FAILED) (0 secs / 10.093 secs)
HeadlessChrome 0.0.0 (Linux 0.0.0): Executed 705 of 763 (4 FAILED) (0 secs / 10.098 secs)
HeadlessChrome 0.0.0 (Linux 0.0.0): Executed 706 of 763 (4 FAILED) (0 secs / 10.101 secs)
HeadlessChrome 0.0.0 (Linux 0.0.0): Executed 707 of 763 (4 FAILED) (0 secs / 10.102 secs)
HeadlessChrome 0.0.0 (Linux 0.0.0): Executed 708 of 763 (4 FAILED) (0 secs / 10.104 secs)
HeadlessChrome 0.0.0 (Linux 0.0.0): Executed 709 of 763 (4 FAILED) (0 secs / 10.105 secs)
HeadlessChrome 0.0.0 (Linux 0.0.0): Executed 710 of 763 (4 FAILED) (0 secs / 10.106 secs)
HeadlessChrome 0.0.0 (Linux 0.0.0): Executed 711 of 763 (4 FAILED) (0 secs / 10.107 secs)
HeadlessChrome 0.0.0 (Linux 0.0.0): Executed 712 of 763 (4 FAILED) (0 secs / 10.112 secs)
HeadlessChrome 0.0.0 (Linux 0.0.0): Executed 713 of 763 (4 FAILED) (0 secs / 10.113 secs)
HeadlessChrome 0.0.0 (Linux 0.0.0): Executed 714 of 763 (4 FAILED) (0 secs / 10.136 secs)
HeadlessChrome 0.0.0 (Linux 0.0.0): Executed 715 of 763 (4 FAILED) (0 secs / 10.138 secs)
HeadlessChrome 0.0.0 (Linux 0.0.0): Executed 716 of 763 (4 FAILED) (0 secs / 10.16 secs)
HeadlessChrome 0.0.0 (Linux 0.0.0): Executed 717 of 763 (4 FAILED) (0 secs / 10.165 secs)
HeadlessChrome 0.0.0 (Linux 0.0.0): Executed 718 of 763 (4 FAILED) (0 secs / 10.167 secs)
HeadlessChrome 0.0.0 (Linux 0.0.0): Executed 719 of 763 (4 FAILED) (0 secs / 10.169 secs)
HeadlessChrome 0.0.0 (Linux 0.0.0): Executed 720 of 763 (4 FAILED) (0 secs / 10.172 secs)
HeadlessChrome 0.0.0 (Linux 0.0.0): Executed 721 of 763 (4 FAILED) (0 secs / 10.174 secs)
HeadlessChrome 0.0.0 (Linux 0.0.0): Executed 722 of 763 (4 FAILED) (0 secs / 10.176 secs)
HeadlessChrome 0.0.0 (Linux 0.0.0): Executed 723 of 763 (4 FAILED) (0 secs / 10.177 secs)
HeadlessChrome 0.0.0 (Linux 0.0.0): Executed 724 of 763 (4 FAILED) (0 secs / 10.179 secs)
HeadlessChrome 0.0.0 (Linux 0.0.0): Executed 725 of 763 (4 FAILED) (0 secs / 10.18 secs)
HeadlessChrome 0.0.0 (Linux 0.0.0): Executed 726 of 763 (4 FAILED) (0 secs / 10.182 secs)
HeadlessChrome 0.0.0 (Linux 0.0.0): Executed 727 of 763 (4 FAILED) (0 secs / 10.183 secs)
HeadlessChrome 0.0.0 (Linux 0.0.0): Executed 728 of 763 (4 FAILED) (0 secs / 10.189 secs)
HeadlessChrome 0.0.0 (Linux 0.0.0): Executed 729 of 763 (4 FAILED) (0 secs / 10.19 secs)
HeadlessChrome 0.0.0 (Linux 0.0.0): Executed 730 of 763 (4 FAILED) (0 secs / 10.191 secs)
HeadlessChrome 0.0.0 (Linux 0.0.0): Executed 731 of 763 (4 FAILED) (0 secs / 10.193 secs)
HeadlessChrome 0.0.0 (Linux 0.0.0): Executed 732 of 763 (4 FAILED) (0 secs / 10.195 secs)
HeadlessChrome 0.0.0 (Linux 0.0.0): Executed 733 of 763 (4 FAILED) (0 secs / 10.198 secs)
HeadlessChrome 0.0.0 (Linux 0.0.0): Executed 734 of 763 (4 FAILED) (0 secs / 10.2 secs)
HeadlessChrome 0.0.0 (Linux 0.0.0): Executed 735 of 763 (4 FAILED) (0 secs / 10.204 secs)
HeadlessChrome 0.0.0 (Linux 0.0.0): Executed 736 of 763 (4 FAILED) (0 secs / 10.206 secs)
HeadlessChrome 0.0.0 (Linux 0.0.0): Executed 737 of 763 (4 FAILED) (0 secs / 10.208 secs)
HeadlessChrome 0.0.0 (Linux 0.0.0): Executed 738 of 763 (4 FAILED) (0 secs / 10.21 secs)
HeadlessChrome 0.0.0 (Linux 0.0.0): Executed 739 of 763 (4 FAILED) (0 secs / 10.211 secs)
HeadlessChrome 0.0.0 (Linux 0.0.0): Executed 740 of 763 (4 FAILED) (0 secs / 10.212 secs)
HeadlessChrome 0.0.0 (Linux 0.0.0): Executed 741 of 763 (4 FAILED) (0 secs / 10.213 secs)
HeadlessChrome 0.0.0 (Linux 0.0.0): Executed 742 of 763 (4 FAILED) (0 secs / 10.214 secs)
HeadlessChrome 0.0.0 (Linux 0.0.0): Executed 743 of 763 (4 FAILED) (0 secs / 10.216 secs)
HeadlessChrome 0.0.0 (Linux 0.0.0): Executed 744 of 763 (4 FAILED) (0 secs / 10.217 secs)
HeadlessChrome 0.0.0 (Linux 0.0.0): Executed 745 of 763 (4 FAILED) (0 secs / 10.219 secs)
HeadlessChrome 0.0.0 (Linux 0.0.0): Executed 746 of 763 (4 FAILED) (0 secs / 10.22 secs)
HeadlessChrome 0.0.0 (Linux 0.0.0): Executed 747 of 763 (4 FAILED) (0 secs / 10.221 secs)
HeadlessChrome 0.0.0 (Linux 0.0.0): Executed 748 of 763 (4 FAILED) (0 secs / 10.222 secs)
HeadlessChrome 0.0.0 (Linux 0.0.0): Executed 749 of 763 (4 FAILED) (0 secs / 10.225 secs)
HeadlessChrome 0.0.0 (Linux 0.0.0): Executed 750 of 763 (4 FAILED) (0 secs / 10.226 secs)
HeadlessChrome 0.0.0 (Linux 0.0.0): Executed 751 of 763 (4 FAILED) (0 secs / 10.23 secs)
HeadlessChrome 0.0.0 (Linux 0.0.0): Executed 752 of 763 (4 FAILED) (0 secs / 10.238 secs)
HeadlessChrome 0.0.0 (Linux 0.0.0): Executed 753 of 763 (4 FAILED) (0 secs / 10.24 secs)
HeadlessChrome 0.0.0 (Linux 0.0.0): Executed 754 of 763 (4 FAILED) (0 secs / 10.243 secs)
HeadlessChrome 0.0.0 (Linux 0.0.0): Executed 755 of 763 (4 FAILED) (0 secs / 10.245 secs)
HeadlessChrome 0.0.0 (Linux 0.0.0): Executed 756 of 763 (4 FAILED) (0 secs / 10.247 secs)
HeadlessChrome 0.0.0 (Linux 0.0.0): Executed 757 of 763 (4 FAILED) (0 secs / 10.25 secs)
HeadlessChrome 0.0.0 (Linux 0.0.0): Executed 758 of 763 (4 FAILED) (0 secs / 10.251 secs)
HeadlessChrome 0.0.0 (Linux 0.0.0): Executed 759 of 763 (4 FAILED) (0 secs / 10.253 secs)
HeadlessChrome 0.0.0 (Linux 0.0.0): Executed 760 of 763 (4 FAILED) (0 secs / 10.254 secs)
HeadlessChrome 0.0.0 (Linux 0.0.0): Executed 761 of 763 (4 FAILED) (0 secs / 10.256 secs)
HeadlessChrome 0.0.0 (Linux 0.0.0): Executed 762 of 763 (4 FAILED) (0 secs / 10.257 secs)
HeadlessChrome 0.0.0 (Linux 0.0.0): Executed 763 of 763 (4 FAILED) (0 secs / 10.259 secs)
HeadlessChrome 0.0.0 (Linux 0.0.0): Executed 763 of 763 (4 FAILED) (10.606 secs / 10.259 secs)
ERROR: Error detected when running the Jasmine tests.
ERROR: Error detected when running the Jasmine tests.
Build step 'Execute shell' marked build as failure

Reply | Threaded
Open this post in threaded view
|

Build failed in Jenkins: pgadmin4-master-python27 #863

pgAdmin 4 Jenkins
See <https://jenkins.pgadmin.org/job/pgadmin4-master-python27/863/display/redirect?page=changes>

Changes:

[Dave Page] Don't show system catalogs in the schemas property list unless show

[Dave Page] Ensure the context menu works after a server is renamed. Fixes #3575

------------------------------------------
[...truncated 1015.00 KB...]
HeadlessChrome 0.0.0 (Linux 0.0.0): Executed 519 of 763 (4 FAILED) (0 secs / 9.368 secs)
HeadlessChrome 0.0.0 (Linux 0.0.0): Executed 520 of 763 (4 FAILED) (0 secs / 9.372 secs)
HeadlessChrome 0.0.0 (Linux 0.0.0): Executed 521 of 763 (4 FAILED) (0 secs / 9.377 secs)
HeadlessChrome 0.0.0 (Linux 0.0.0): Executed 522 of 763 (4 FAILED) (0 secs / 9.383 secs)
HeadlessChrome 0.0.0 (Linux 0.0.0): Executed 523 of 763 (4 FAILED) (0 secs / 9.386 secs)
HeadlessChrome 0.0.0 (Linux 0.0.0): Executed 524 of 763 (4 FAILED) (0 secs / 9.39 secs)
HeadlessChrome 0.0.0 (Linux 0.0.0): Executed 525 of 763 (4 FAILED) (0 secs / 9.392 secs)
HeadlessChrome 0.0.0 (Linux 0.0.0): Executed 526 of 763 (4 FAILED) (0 secs / 9.397 secs)
HeadlessChrome 0.0.0 (Linux 0.0.0): Executed 527 of 763 (4 FAILED) (0 secs / 9.4 secs)
HeadlessChrome 0.0.0 (Linux 0.0.0): Executed 528 of 763 (4 FAILED) (0 secs / 9.404 secs)
HeadlessChrome 0.0.0 (Linux 0.0.0): Executed 529 of 763 (4 FAILED) (0 secs / 9.407 secs)
HeadlessChrome 0.0.0 (Linux 0.0.0): Executed 530 of 763 (4 FAILED) (0 secs / 9.409 secs)
HeadlessChrome 0.0.0 (Linux 0.0.0): Executed 531 of 763 (4 FAILED) (0 secs / 9.411 secs)
HeadlessChrome 0.0.0 (Linux 0.0.0): Executed 532 of 763 (4 FAILED) (0 secs / 9.414 secs)
HeadlessChrome 0.0.0 (Linux 0.0.0): Executed 533 of 763 (4 FAILED) (0 secs / 9.416 secs)
HeadlessChrome 0.0.0 (Linux 0.0.0): Executed 534 of 763 (4 FAILED) (0 secs / 9.423 secs)
HeadlessChrome 0.0.0 (Linux 0.0.0): Executed 535 of 763 (4 FAILED) (0 secs / 9.43 secs)
HeadlessChrome 0.0.0 (Linux 0.0.0): Executed 536 of 763 (4 FAILED) (0 secs / 9.434 secs)
HeadlessChrome 0.0.0 (Linux 0.0.0): Executed 537 of 763 (4 FAILED) (0 secs / 9.438 secs)
HeadlessChrome 0.0.0 (Linux 0.0.0): Executed 538 of 763 (4 FAILED) (0 secs / 9.443 secs)
HeadlessChrome 0.0.0 (Linux 0.0.0): Executed 539 of 763 (4 FAILED) (0 secs / 9.447 secs)
HeadlessChrome 0.0.0 (Linux 0.0.0): Executed 540 of 763 (4 FAILED) (0 secs / 9.452 secs)
HeadlessChrome 0.0.0 (Linux 0.0.0): Executed 541 of 763 (4 FAILED) (0 secs / 9.456 secs)
HeadlessChrome 0.0.0 (Linux 0.0.0): Executed 542 of 763 (4 FAILED) (0 secs / 9.461 secs)
HeadlessChrome 0.0.0 (Linux 0.0.0): Executed 543 of 763 (4 FAILED) (0 secs / 9.467 secs)
HeadlessChrome 0.0.0 (Linux 0.0.0): Executed 544 of 763 (4 FAILED) (0 secs / 9.47 secs)
HeadlessChrome 0.0.0 (Linux 0.0.0): Executed 545 of 763 (4 FAILED) (0 secs / 9.473 secs)
HeadlessChrome 0.0.0 (Linux 0.0.0): Executed 546 of 763 (4 FAILED) (0 secs / 9.478 secs)
HeadlessChrome 0.0.0 (Linux 0.0.0): Executed 547 of 763 (4 FAILED) (0 secs / 9.483 secs)
HeadlessChrome 0.0.0 (Linux 0.0.0): Executed 548 of 763 (4 FAILED) (0 secs / 9.486 secs)
HeadlessChrome 0.0.0 (Linux 0.0.0): Executed 549 of 763 (4 FAILED) (0 secs / 9.491 secs)
HeadlessChrome 0.0.0 (Linux 0.0.0): Executed 550 of 763 (4 FAILED) (0 secs / 9.528 secs)
HeadlessChrome 0.0.0 (Linux 0.0.0): Executed 551 of 763 (4 FAILED) (0 secs / 9.536 secs)
HeadlessChrome 0.0.0 (Linux 0.0.0): Executed 552 of 763 (4 FAILED) (0 secs / 9.544 secs)
HeadlessChrome 0.0.0 (Linux 0.0.0): Executed 553 of 763 (4 FAILED) (0 secs / 9.549 secs)
HeadlessChrome 0.0.0 (Linux 0.0.0): Executed 554 of 763 (4 FAILED) (0 secs / 9.553 secs)
HeadlessChrome 0.0.0 (Linux 0.0.0): Executed 555 of 763 (4 FAILED) (0 secs / 9.557 secs)
HeadlessChrome 0.0.0 (Linux 0.0.0): Executed 556 of 763 (4 FAILED) (0 secs / 9.559 secs)
HeadlessChrome 0.0.0 (Linux 0.0.0): Executed 557 of 763 (4 FAILED) (0 secs / 9.561 secs)
HeadlessChrome 0.0.0 (Linux 0.0.0): Executed 558 of 763 (4 FAILED) (0 secs / 9.565 secs)
HeadlessChrome 0.0.0 (Linux 0.0.0): Executed 559 of 763 (4 FAILED) (0 secs / 9.568 secs)
HeadlessChrome 0.0.0 (Linux 0.0.0): Executed 560 of 763 (4 FAILED) (0 secs / 9.572 secs)
HeadlessChrome 0.0.0 (Linux 0.0.0): Executed 561 of 763 (4 FAILED) (0 secs / 9.578 secs)
HeadlessChrome 0.0.0 (Linux 0.0.0): Executed 562 of 763 (4 FAILED) (0 secs / 9.58 secs)
HeadlessChrome 0.0.0 (Linux 0.0.0): Executed 563 of 763 (4 FAILED) (0 secs / 9.583 secs)
HeadlessChrome 0.0.0 (Linux 0.0.0): Executed 564 of 763 (4 FAILED) (0 secs / 9.587 secs)
HeadlessChrome 0.0.0 (Linux 0.0.0): Executed 565 of 763 (4 FAILED) (0 secs / 9.594 secs)
HeadlessChrome 0.0.0 (Linux 0.0.0): Executed 566 of 763 (4 FAILED) (0 secs / 9.6 secs)
HeadlessChrome 0.0.0 (Linux 0.0.0): Executed 567 of 763 (4 FAILED) (0 secs / 9.606 secs)
HeadlessChrome 0.0.0 (Linux 0.0.0): Executed 568 of 763 (4 FAILED) (0 secs / 9.609 secs)
HeadlessChrome 0.0.0 (Linux 0.0.0): Executed 569 of 763 (4 FAILED) (0 secs / 9.613 secs)
HeadlessChrome 0.0.0 (Linux 0.0.0): Executed 570 of 763 (4 FAILED) (0 secs / 9.616 secs)
HeadlessChrome 0.0.0 (Linux 0.0.0): Executed 571 of 763 (4 FAILED) (0 secs / 9.619 secs)
HeadlessChrome 0.0.0 (Linux 0.0.0): Executed 572 of 763 (4 FAILED) (0 secs / 9.623 secs)
HeadlessChrome 0.0.0 (Linux 0.0.0): Executed 573 of 763 (4 FAILED) (0 secs / 9.628 secs)
HeadlessChrome 0.0.0 (Linux 0.0.0): Executed 574 of 763 (4 FAILED) (0 secs / 9.632 secs)
HeadlessChrome 0.0.0 (Linux 0.0.0): Executed 575 of 763 (4 FAILED) (0 secs / 9.635 secs)
HeadlessChrome 0.0.0 (Linux 0.0.0): Executed 576 of 763 (4 FAILED) (0 secs / 9.637 secs)
HeadlessChrome 0.0.0 (Linux 0.0.0): Executed 577 of 763 (4 FAILED) (0 secs / 9.639 secs)
HeadlessChrome 0.0.0 (Linux 0.0.0): Executed 578 of 763 (4 FAILED) (0 secs / 9.643 secs)
HeadlessChrome 0.0.0 (Linux 0.0.0): Executed 579 of 763 (4 FAILED) (0 secs / 9.645 secs)
HeadlessChrome 0.0.0 (Linux 0.0.0): Executed 580 of 763 (4 FAILED) (0 secs / 9.647 secs)
HeadlessChrome 0.0.0 (Linux 0.0.0): Executed 581 of 763 (4 FAILED) (0 secs / 9.648 secs)
HeadlessChrome 0.0.0 (Linux 0.0.0): Executed 582 of 763 (4 FAILED) (0 secs / 9.65 secs)
HeadlessChrome 0.0.0 (Linux 0.0.0): Executed 583 of 763 (4 FAILED) (0 secs / 9.652 secs)
HeadlessChrome 0.0.0 (Linux 0.0.0): Executed 584 of 763 (4 FAILED) (0 secs / 9.655 secs)
HeadlessChrome 0.0.0 (Linux 0.0.0): Executed 585 of 763 (4 FAILED) (0 secs / 9.656 secs)
HeadlessChrome 0.0.0 (Linux 0.0.0): Executed 586 of 763 (4 FAILED) (0 secs / 9.657 secs)
HeadlessChrome 0.0.0 (Linux 0.0.0): Executed 587 of 763 (4 FAILED) (0 secs / 9.658 secs)
HeadlessChrome 0.0.0 (Linux 0.0.0): Executed 588 of 763 (4 FAILED) (0 secs / 9.66 secs)
HeadlessChrome 0.0.0 (Linux 0.0.0): Executed 589 of 763 (4 FAILED) (0 secs / 9.662 secs)
HeadlessChrome 0.0.0 (Linux 0.0.0): Executed 590 of 763 (4 FAILED) (0 secs / 9.664 secs)
HeadlessChrome 0.0.0 (Linux 0.0.0): Executed 591 of 763 (4 FAILED) (0 secs / 9.667 secs)
HeadlessChrome 0.0.0 (Linux 0.0.0): Executed 592 of 763 (4 FAILED) (0 secs / 9.669 secs)
HeadlessChrome 0.0.0 (Linux 0.0.0): Executed 593 of 763 (4 FAILED) (0 secs / 9.671 secs)
HeadlessChrome 0.0.0 (Linux 0.0.0): Executed 594 of 763 (4 FAILED) (0 secs / 9.672 secs)
HeadlessChrome 0.0.0 (Linux 0.0.0): Executed 595 of 763 (4 FAILED) (0 secs / 9.676 secs)
HeadlessChrome 0.0.0 (Linux 0.0.0): Executed 596 of 763 (4 FAILED) (0 secs / 9.678 secs)
HeadlessChrome 0.0.0 (Linux 0.0.0): Executed 597 of 763 (4 FAILED) (0 secs / 9.681 secs)
HeadlessChrome 0.0.0 (Linux 0.0.0): Executed 598 of 763 (4 FAILED) (0 secs / 9.682 secs)
HeadlessChrome 0.0.0 (Linux 0.0.0): Executed 599 of 763 (4 FAILED) (0 secs / 9.684 secs)
HeadlessChrome 0.0.0 (Linux 0.0.0): Executed 600 of 763 (4 FAILED) (0 secs / 9.686 secs)
HeadlessChrome 0.0.0 (Linux 0.0.0): Executed 601 of 763 (4 FAILED) (0 secs / 9.688 secs)
HeadlessChrome 0.0.0 (Linux 0.0.0): Executed 602 of 763 (4 FAILED) (0 secs / 9.689 secs)
HeadlessChrome 0.0.0 (Linux 0.0.0): Executed 603 of 763 (4 FAILED) (0 secs / 9.69 secs)
HeadlessChrome 0.0.0 (Linux 0.0.0): Executed 604 of 763 (4 FAILED) (0 secs / 9.692 secs)
HeadlessChrome 0.0.0 (Linux 0.0.0): Executed 605 of 763 (4 FAILED) (0 secs / 9.693 secs)
HeadlessChrome 0.0.0 (Linux 0.0.0): Executed 606 of 763 (4 FAILED) (0 secs / 9.695 secs)
HeadlessChrome 0.0.0 (Linux 0.0.0): Executed 607 of 763 (4 FAILED) (0 secs / 9.697 secs)
HeadlessChrome 0.0.0 (Linux 0.0.0): Executed 608 of 763 (4 FAILED) (0 secs / 9.699 secs)
HeadlessChrome 0.0.0 (Linux 0.0.0): Executed 609 of 763 (4 FAILED) (0 secs / 9.7 secs)
HeadlessChrome 0.0.0 (Linux 0.0.0): Executed 610 of 763 (4 FAILED) (0 secs / 9.702 secs)
HeadlessChrome 0.0.0 (Linux 0.0.0): Executed 611 of 763 (4 FAILED) (0 secs / 9.703 secs)
HeadlessChrome 0.0.0 (Linux 0.0.0): Executed 612 of 763 (4 FAILED) (0 secs / 9.707 secs)
HeadlessChrome 0.0.0 (Linux 0.0.0): Executed 613 of 763 (4 FAILED) (0 secs / 9.708 secs)
HeadlessChrome 0.0.0 (Linux 0.0.0): Executed 614 of 763 (4 FAILED) (0 secs / 9.71 secs)
HeadlessChrome 0.0.0 (Linux 0.0.0): Executed 615 of 763 (4 FAILED) (0 secs / 9.711 secs)
HeadlessChrome 0.0.0 (Linux 0.0.0): Executed 616 of 763 (4 FAILED) (0 secs / 9.713 secs)
HeadlessChrome 0.0.0 (Linux 0.0.0): Executed 617 of 763 (4 FAILED) (0 secs / 9.716 secs)
HeadlessChrome 0.0.0 (Linux 0.0.0): Executed 618 of 763 (4 FAILED) (0 secs / 9.717 secs)
HeadlessChrome 0.0.0 (Linux 0.0.0): Executed 619 of 763 (4 FAILED) (0 secs / 9.72 secs)
HeadlessChrome 0.0.0 (Linux 0.0.0): Executed 620 of 763 (4 FAILED) (0 secs / 9.722 secs)
HeadlessChrome 0.0.0 (Linux 0.0.0): Executed 621 of 763 (4 FAILED) (0 secs / 9.722 secs)
HeadlessChrome 0.0.0 (Linux 0.0.0): Executed 622 of 763 (4 FAILED) (0 secs / 9.723 secs)
HeadlessChrome 0.0.0 (Linux 0.0.0): Executed 623 of 763 (4 FAILED) (0 secs / 9.725 secs)
HeadlessChrome 0.0.0 (Linux 0.0.0): Executed 624 of 763 (4 FAILED) (0 secs / 9.726 secs)
HeadlessChrome 0.0.0 (Linux 0.0.0): Executed 625 of 763 (4 FAILED) (0 secs / 9.727 secs)
HeadlessChrome 0.0.0 (Linux 0.0.0): Executed 626 of 763 (4 FAILED) (0 secs / 9.728 secs)
HeadlessChrome 0.0.0 (Linux 0.0.0): Executed 627 of 763 (4 FAILED) (0 secs / 9.733 secs)
HeadlessChrome 0.0.0 (Linux 0.0.0): Executed 628 of 763 (4 FAILED) (0 secs / 9.734 secs)
HeadlessChrome 0.0.0 (Linux 0.0.0): Executed 629 of 763 (4 FAILED) (0 secs / 9.736 secs)
HeadlessChrome 0.0.0 (Linux 0.0.0): Executed 630 of 763 (4 FAILED) (0 secs / 9.737 secs)
HeadlessChrome 0.0.0 (Linux 0.0.0): Executed 631 of 763 (4 FAILED) (0 secs / 9.739 secs)
HeadlessChrome 0.0.0 (Linux 0.0.0): Executed 632 of 763 (4 FAILED) (0 secs / 9.741 secs)
HeadlessChrome 0.0.0 (Linux 0.0.0): Executed 633 of 763 (4 FAILED) (0 secs / 9.743 secs)
HeadlessChrome 0.0.0 (Linux 0.0.0): Executed 634 of 763 (4 FAILED) (0 secs / 9.745 secs)
HeadlessChrome 0.0.0 (Linux 0.0.0): Executed 635 of 763 (4 FAILED) (0 secs / 9.748 secs)
HeadlessChrome 0.0.0 (Linux 0.0.0): Executed 636 of 763 (4 FAILED) (0 secs / 9.75 secs)
HeadlessChrome 0.0.0 (Linux 0.0.0): Executed 637 of 763 (4 FAILED) (0 secs / 9.752 secs)
HeadlessChrome 0.0.0 (Linux 0.0.0): Executed 638 of 763 (4 FAILED) (0 secs / 9.753 secs)
HeadlessChrome 0.0.0 (Linux 0.0.0): Executed 639 of 763 (4 FAILED) (0 secs / 9.755 secs)
HeadlessChrome 0.0.0 (Linux 0.0.0): Executed 640 of 763 (4 FAILED) (0 secs / 9.757 secs)
HeadlessChrome 0.0.0 (Linux 0.0.0): Executed 641 of 763 (4 FAILED) (0 secs / 9.761 secs)
HeadlessChrome 0.0.0 (Linux 0.0.0): Executed 642 of 763 (4 FAILED) (0 secs / 9.762 secs)
HeadlessChrome 0.0.0 (Linux 0.0.0): Executed 643 of 763 (4 FAILED) (0 secs / 9.763 secs)
HeadlessChrome 0.0.0 (Linux 0.0.0): Executed 644 of 763 (4 FAILED) (0 secs / 9.764 secs)
HeadlessChrome 0.0.0 (Linux 0.0.0): Executed 645 of 763 (4 FAILED) (0 secs / 9.768 secs)
HeadlessChrome 0.0.0 (Linux 0.0.0): Executed 646 of 763 (4 FAILED) (0 secs / 9.77 secs)
HeadlessChrome 0.0.0 (Linux 0.0.0): Executed 647 of 763 (4 FAILED) (0 secs / 9.773 secs)
HeadlessChrome 0.0.0 (Linux 0.0.0): Executed 648 of 763 (4 FAILED) (0 secs / 9.775 secs)
HeadlessChrome 0.0.0 (Linux 0.0.0): Executed 649 of 763 (4 FAILED) (0 secs / 9.785 secs)
HeadlessChrome 0.0.0 (Linux 0.0.0): Executed 650 of 763 (4 FAILED) (0 secs / 9.786 secs)
HeadlessChrome 0.0.0 (Linux 0.0.0): Executed 651 of 763 (4 FAILED) (0 secs / 9.788 secs)
HeadlessChrome 0.0.0 (Linux 0.0.0): Executed 652 of 763 (4 FAILED) (0 secs / 9.789 secs)
HeadlessChrome 0.0.0 (Linux 0.0.0): Executed 653 of 763 (4 FAILED) (0 secs / 9.791 secs)
HeadlessChrome 0.0.0 (Linux 0.0.0): Executed 654 of 763 (4 FAILED) (0 secs / 9.792 secs)
HeadlessChrome 0.0.0 (Linux 0.0.0): Executed 655 of 763 (4 FAILED) (0 secs / 9.794 secs)
HeadlessChrome 0.0.0 (Linux 0.0.0): Executed 656 of 763 (4 FAILED) (0 secs / 9.796 secs)
HeadlessChrome 0.0.0 (Linux 0.0.0): Executed 657 of 763 (4 FAILED) (0 secs / 9.798 secs)
HeadlessChrome 0.0.0 (Linux 0.0.0): Executed 658 of 763 (4 FAILED) (0 secs / 9.8 secs)
HeadlessChrome 0.0.0 (Linux 0.0.0): Executed 659 of 763 (4 FAILED) (0 secs / 9.801 secs)
HeadlessChrome 0.0.0 (Linux 0.0.0): Executed 660 of 763 (4 FAILED) (0 secs / 9.802 secs)
HeadlessChrome 0.0.0 (Linux 0.0.0): Executed 661 of 763 (4 FAILED) (0 secs / 9.804 secs)
HeadlessChrome 0.0.0 (Linux 0.0.0): Executed 662 of 763 (4 FAILED) (0 secs / 9.805 secs)
HeadlessChrome 0.0.0 (Linux 0.0.0): Executed 663 of 763 (4 FAILED) (0 secs / 9.806 secs)
HeadlessChrome 0.0.0 (Linux 0.0.0): Executed 664 of 763 (4 FAILED) (0 secs / 9.808 secs)
HeadlessChrome 0.0.0 (Linux 0.0.0): Executed 665 of 763 (4 FAILED) (0 secs / 9.808 secs)
HeadlessChrome 0.0.0 (Linux 0.0.0): Executed 666 of 763 (4 FAILED) (0 secs / 9.812 secs)
HeadlessChrome 0.0.0 (Linux 0.0.0): Executed 667 of 763 (4 FAILED) (0 secs / 9.813 secs)
HeadlessChrome 0.0.0 (Linux 0.0.0): Executed 668 of 763 (4 FAILED) (0 secs / 9.815 secs)
HeadlessChrome 0.0.0 (Linux 0.0.0): Executed 669 of 763 (4 FAILED) (0 secs / 9.818 secs)
HeadlessChrome 0.0.0 (Linux 0.0.0): Executed 670 of 763 (4 FAILED) (0 secs / 9.82 secs)
HeadlessChrome 0.0.0 (Linux 0.0.0): Executed 671 of 763 (4 FAILED) (0 secs / 9.823 secs)
HeadlessChrome 0.0.0 (Linux 0.0.0): Executed 672 of 763 (4 FAILED) (0 secs / 9.826 secs)
HeadlessChrome 0.0.0 (Linux 0.0.0): Executed 673 of 763 (4 FAILED) (0 secs / 9.828 secs)
HeadlessChrome 0.0.0 (Linux 0.0.0): Executed 674 of 763 (4 FAILED) (0 secs / 9.829 secs)
HeadlessChrome 0.0.0 (Linux 0.0.0): Executed 675 of 763 (4 FAILED) (0 secs / 9.831 secs)
HeadlessChrome 0.0.0 (Linux 0.0.0): Executed 676 of 763 (4 FAILED) (0 secs / 9.834 secs)
HeadlessChrome 0.0.0 (Linux 0.0.0): Executed 677 of 763 (4 FAILED) (0 secs / 9.838 secs)
HeadlessChrome 0.0.0 (Linux 0.0.0): Executed 678 of 763 (4 FAILED) (0 secs / 9.842 secs)
HeadlessChrome 0.0.0 (Linux 0.0.0): Executed 679 of 763 (4 FAILED) (0 secs / 9.846 secs)
HeadlessChrome 0.0.0 (Linux 0.0.0): Executed 680 of 763 (4 FAILED) (0 secs / 9.869 secs)
HeadlessChrome 0.0.0 (Linux 0.0.0): Executed 681 of 763 (4 FAILED) (0 secs / 9.872 secs)
HeadlessChrome 0.0.0 (Linux 0.0.0): Executed 682 of 763 (4 FAILED) (0 secs / 9.876 secs)
HeadlessChrome 0.0.0 (Linux 0.0.0): Executed 683 of 763 (4 FAILED) (0 secs / 9.897 secs)
HeadlessChrome 0.0.0 (Linux 0.0.0): Executed 684 of 763 (4 FAILED) (0 secs / 9.9 secs)
HeadlessChrome 0.0.0 (Linux 0.0.0): Executed 685 of 763 (4 FAILED) (0 secs / 9.902 secs)
HeadlessChrome 0.0.0 (Linux 0.0.0): Executed 686 of 763 (4 FAILED) (0 secs / 9.906 secs)
HeadlessChrome 0.0.0 (Linux 0.0.0): Executed 687 of 763 (4 FAILED) (0 secs / 9.928 secs)
HeadlessChrome 0.0.0 (Linux 0.0.0): Executed 688 of 763 (4 FAILED) (0 secs / 9.931 secs)
HeadlessChrome 0.0.0 (Linux 0.0.0): Executed 689 of 763 (4 FAILED) (0 secs / 9.936 secs)
HeadlessChrome 0.0.0 (Linux 0.0.0): Executed 690 of 763 (4 FAILED) (0 secs / 9.959 secs)
HeadlessChrome 0.0.0 (Linux 0.0.0): Executed 691 of 763 (4 FAILED) (0 secs / 9.961 secs)
HeadlessChrome 0.0.0 (Linux 0.0.0): Executed 692 of 763 (4 FAILED) (0 secs / 9.962 secs)
HeadlessChrome 0.0.0 (Linux 0.0.0): Executed 693 of 763 (4 FAILED) (0 secs / 9.967 secs)
HeadlessChrome 0.0.0 (Linux 0.0.0): Executed 694 of 763 (4 FAILED) (0 secs / 9.969 secs)
HeadlessChrome 0.0.0 (Linux 0.0.0): Executed 695 of 763 (4 FAILED) (0 secs / 9.971 secs)
HeadlessChrome 0.0.0 (Linux 0.0.0): Executed 696 of 763 (4 FAILED) (0 secs / 9.973 secs)
HeadlessChrome 0.0.0 (Linux 0.0.0): Executed 697 of 763 (4 FAILED) (0 secs / 9.973 secs)
HeadlessChrome 0.0.0 (Linux 0.0.0): Executed 698 of 763 (4 FAILED) (0 secs / 9.975 secs)
HeadlessChrome 0.0.0 (Linux 0.0.0): Executed 699 of 763 (4 FAILED) (0 secs / 9.977 secs)
HeadlessChrome 0.0.0 (Linux 0.0.0): Executed 700 of 763 (4 FAILED) (0 secs / 9.98 secs)
HeadlessChrome 0.0.0 (Linux 0.0.0): Executed 701 of 763 (4 FAILED) (0 secs / 9.982 secs)
HeadlessChrome 0.0.0 (Linux 0.0.0): Executed 702 of 763 (4 FAILED) (0 secs / 9.983 secs)
HeadlessChrome 0.0.0 (Linux 0.0.0): Executed 703 of 763 (4 FAILED) (0 secs / 9.985 secs)
HeadlessChrome 0.0.0 (Linux 0.0.0): Executed 704 of 763 (4 FAILED) (0 secs / 9.986 secs)
HeadlessChrome 0.0.0 (Linux 0.0.0): Executed 705 of 763 (4 FAILED) (0 secs / 9.989 secs)
HeadlessChrome 0.0.0 (Linux 0.0.0): Executed 706 of 763 (4 FAILED) (0 secs / 9.993 secs)
HeadlessChrome 0.0.0 (Linux 0.0.0): Executed 707 of 763 (4 FAILED) (0 secs / 9.994 secs)
HeadlessChrome 0.0.0 (Linux 0.0.0): Executed 708 of 763 (4 FAILED) (0 secs / 9.996 secs)
HeadlessChrome 0.0.0 (Linux 0.0.0): Executed 709 of 763 (4 FAILED) (0 secs / 9.998 secs)
HeadlessChrome 0.0.0 (Linux 0.0.0): Executed 710 of 763 (4 FAILED) (0 secs / 9.999 secs)
HeadlessChrome 0.0.0 (Linux 0.0.0): Executed 711 of 763 (4 FAILED) (0 secs / 10.001 secs)
HeadlessChrome 0.0.0 (Linux 0.0.0): Executed 712 of 763 (4 FAILED) (0 secs / 10.004 secs)
HeadlessChrome 0.0.0 (Linux 0.0.0): Executed 713 of 763 (4 FAILED) (0 secs / 10.007 secs)
HeadlessChrome 0.0.0 (Linux 0.0.0): Executed 714 of 763 (4 FAILED) (0 secs / 10.03 secs)
HeadlessChrome 0.0.0 (Linux 0.0.0): Executed 715 of 763 (4 FAILED) (0 secs / 10.032 secs)
HeadlessChrome 0.0.0 (Linux 0.0.0): Executed 716 of 763 (4 FAILED) (0 secs / 10.053 secs)
HeadlessChrome 0.0.0 (Linux 0.0.0): Executed 717 of 763 (4 FAILED) (0 secs / 10.055 secs)
HeadlessChrome 0.0.0 (Linux 0.0.0): Executed 718 of 763 (4 FAILED) (0 secs / 10.057 secs)
HeadlessChrome 0.0.0 (Linux 0.0.0): Executed 719 of 763 (4 FAILED) (0 secs / 10.059 secs)
HeadlessChrome 0.0.0 (Linux 0.0.0): Executed 720 of 763 (4 FAILED) (0 secs / 10.061 secs)
HeadlessChrome 0.0.0 (Linux 0.0.0): Executed 721 of 763 (4 FAILED) (0 secs / 10.063 secs)
HeadlessChrome 0.0.0 (Linux 0.0.0): Executed 722 of 763 (4 FAILED) (0 secs / 10.064 secs)
HeadlessChrome 0.0.0 (Linux 0.0.0): Executed 723 of 763 (4 FAILED) (0 secs / 10.067 secs)
HeadlessChrome 0.0.0 (Linux 0.0.0): Executed 724 of 763 (4 FAILED) (0 secs / 10.068 secs)
HeadlessChrome 0.0.0 (Linux 0.0.0): Executed 725 of 763 (4 FAILED) (0 secs / 10.072 secs)
HeadlessChrome 0.0.0 (Linux 0.0.0): Executed 726 of 763 (4 FAILED) (0 secs / 10.074 secs)
HeadlessChrome 0.0.0 (Linux 0.0.0): Executed 727 of 763 (4 FAILED) (0 secs / 10.075 secs)
HeadlessChrome 0.0.0 (Linux 0.0.0): Executed 728 of 763 (4 FAILED) (0 secs / 10.077 secs)
HeadlessChrome 0.0.0 (Linux 0.0.0): Executed 729 of 763 (4 FAILED) (0 secs / 10.078 secs)
HeadlessChrome 0.0.0 (Linux 0.0.0): Executed 730 of 763 (4 FAILED) (0 secs / 10.079 secs)
HeadlessChrome 0.0.0 (Linux 0.0.0): Executed 731 of 763 (4 FAILED) (0 secs / 10.08 secs)
HeadlessChrome 0.0.0 (Linux 0.0.0): Executed 732 of 763 (4 FAILED) (0 secs / 10.081 secs)
HeadlessChrome 0.0.0 (Linux 0.0.0): Executed 733 of 763 (4 FAILED) (0 secs / 10.085 secs)
HeadlessChrome 0.0.0 (Linux 0.0.0): Executed 734 of 763 (4 FAILED) (0 secs / 10.086 secs)
HeadlessChrome 0.0.0 (Linux 0.0.0): Executed 735 of 763 (4 FAILED) (0 secs / 10.088 secs)
HeadlessChrome 0.0.0 (Linux 0.0.0): Executed 736 of 763 (4 FAILED) (0 secs / 10.09 secs)
HeadlessChrome 0.0.0 (Linux 0.0.0): Executed 737 of 763 (4 FAILED) (0 secs / 10.092 secs)
HeadlessChrome 0.0.0 (Linux 0.0.0): Executed 738 of 763 (4 FAILED) (0 secs / 10.093 secs)
HeadlessChrome 0.0.0 (Linux 0.0.0): Executed 739 of 763 (4 FAILED) (0 secs / 10.095 secs)
HeadlessChrome 0.0.0 (Linux 0.0.0): Executed 740 of 763 (4 FAILED) (0 secs / 10.099 secs)
HeadlessChrome 0.0.0 (Linux 0.0.0): Executed 741 of 763 (4 FAILED) (0 secs / 10.1 secs)
HeadlessChrome 0.0.0 (Linux 0.0.0): Executed 742 of 763 (4 FAILED) (0 secs / 10.101 secs)
HeadlessChrome 0.0.0 (Linux 0.0.0): Executed 743 of 763 (4 FAILED) (0 secs / 10.104 secs)
HeadlessChrome 0.0.0 (Linux 0.0.0): Executed 744 of 763 (4 FAILED) (0 secs / 10.105 secs)
HeadlessChrome 0.0.0 (Linux 0.0.0): Executed 745 of 763 (4 FAILED) (0 secs / 10.107 secs)
HeadlessChrome 0.0.0 (Linux 0.0.0): Executed 746 of 763 (4 FAILED) (0 secs / 10.109 secs)
HeadlessChrome 0.0.0 (Linux 0.0.0): Executed 747 of 763 (4 FAILED) (0 secs / 10.11 secs)
HeadlessChrome 0.0.0 (Linux 0.0.0): Executed 748 of 763 (4 FAILED) (0 secs / 10.115 secs)
HeadlessChrome 0.0.0 (Linux 0.0.0): Executed 749 of 763 (4 FAILED) (0 secs / 10.117 secs)
HeadlessChrome 0.0.0 (Linux 0.0.0): Executed 750 of 763 (4 FAILED) (0 secs / 10.118 secs)
HeadlessChrome 0.0.0 (Linux 0.0.0): Executed 751 of 763 (4 FAILED) (0 secs / 10.119 secs)
HeadlessChrome 0.0.0 (Linux 0.0.0): Executed 752 of 763 (4 FAILED) (0 secs / 10.12 secs)
HeadlessChrome 0.0.0 (Linux 0.0.0): Executed 753 of 763 (4 FAILED) (0 secs / 10.121 secs)
HeadlessChrome 0.0.0 (Linux 0.0.0): Executed 754 of 763 (4 FAILED) (0 secs / 10.123 secs)
HeadlessChrome 0.0.0 (Linux 0.0.0): Executed 755 of 763 (4 FAILED) (0 secs / 10.126 secs)
HeadlessChrome 0.0.0 (Linux 0.0.0): Executed 756 of 763 (4 FAILED) (0 secs / 10.128 secs)
HeadlessChrome 0.0.0 (Linux 0.0.0): Executed 757 of 763 (4 FAILED) (0 secs / 10.129 secs)
HeadlessChrome 0.0.0 (Linux 0.0.0): Executed 758 of 763 (4 FAILED) (0 secs / 10.132 secs)
HeadlessChrome 0.0.0 (Linux 0.0.0): Executed 759 of 763 (4 FAILED) (0 secs / 10.134 secs)
HeadlessChrome 0.0.0 (Linux 0.0.0): Executed 760 of 763 (4 FAILED) (0 secs / 10.135 secs)
HeadlessChrome 0.0.0 (Linux 0.0.0): Executed 761 of 763 (4 FAILED) (0 secs / 10.138 secs)
HeadlessChrome 0.0.0 (Linux 0.0.0): Executed 762 of 763 (4 FAILED) (0 secs / 10.14 secs)
HeadlessChrome 0.0.0 (Linux 0.0.0): Executed 763 of 763 (4 FAILED) (0 secs / 10.141 secs)
HeadlessChrome 0.0.0 (Linux 0.0.0): Executed 763 of 763 (4 FAILED) (10.487 secs / 10.141 secs)
ERROR: Error detected when running the Jasmine tests.
ERROR: Error detected when running the Jasmine tests.
Build step 'Execute shell' marked build as failure

Reply | Threaded
Open this post in threaded view
|

Jenkins build is back to normal : pgadmin4-master-python27 #864

pgAdmin 4 Jenkins