Build failed in Jenkins: pgadmin4-master-python34 #850

classic Classic list List threaded Threaded
3 messages Options
Reply | Threaded
Open this post in threaded view
|

Build failed in Jenkins: pgadmin4-master-python34 #850

pgAdmin 4 Jenkins
See <https://jenkins.pgadmin.org/job/pgadmin4-master-python34/850/display/redirect?page=changes>

Changes:

[Dave Page] Fix help for the backup/restore dialogues. Fixes #3861

------------------------------------------
[...truncated 1012.86 KB...]
HeadlessChrome 0.0.0 (Linux 0.0.0): Executed 519 of 763 (4 FAILED) (0 secs / 9.385 secs)
HeadlessChrome 0.0.0 (Linux 0.0.0): Executed 520 of 763 (4 FAILED) (0 secs / 9.388 secs)
HeadlessChrome 0.0.0 (Linux 0.0.0): Executed 521 of 763 (4 FAILED) (0 secs / 9.392 secs)
HeadlessChrome 0.0.0 (Linux 0.0.0): Executed 522 of 763 (4 FAILED) (0 secs / 9.398 secs)
HeadlessChrome 0.0.0 (Linux 0.0.0): Executed 523 of 763 (4 FAILED) (0 secs / 9.402 secs)
HeadlessChrome 0.0.0 (Linux 0.0.0): Executed 524 of 763 (4 FAILED) (0 secs / 9.405 secs)
HeadlessChrome 0.0.0 (Linux 0.0.0): Executed 525 of 763 (4 FAILED) (0 secs / 9.409 secs)
HeadlessChrome 0.0.0 (Linux 0.0.0): Executed 526 of 763 (4 FAILED) (0 secs / 9.418 secs)
HeadlessChrome 0.0.0 (Linux 0.0.0): Executed 527 of 763 (4 FAILED) (0 secs / 9.421 secs)
HeadlessChrome 0.0.0 (Linux 0.0.0): Executed 528 of 763 (4 FAILED) (0 secs / 9.423 secs)
HeadlessChrome 0.0.0 (Linux 0.0.0): Executed 529 of 763 (4 FAILED) (0 secs / 9.425 secs)
HeadlessChrome 0.0.0 (Linux 0.0.0): Executed 530 of 763 (4 FAILED) (0 secs / 9.43 secs)
HeadlessChrome 0.0.0 (Linux 0.0.0): Executed 531 of 763 (4 FAILED) (0 secs / 9.438 secs)
HeadlessChrome 0.0.0 (Linux 0.0.0): Executed 532 of 763 (4 FAILED) (0 secs / 9.441 secs)
HeadlessChrome 0.0.0 (Linux 0.0.0): Executed 533 of 763 (4 FAILED) (0 secs / 9.445 secs)
HeadlessChrome 0.0.0 (Linux 0.0.0): Executed 534 of 763 (4 FAILED) (0 secs / 9.45 secs)
HeadlessChrome 0.0.0 (Linux 0.0.0): Executed 535 of 763 (4 FAILED) (0 secs / 9.457 secs)
HeadlessChrome 0.0.0 (Linux 0.0.0): Executed 536 of 763 (4 FAILED) (0 secs / 9.462 secs)
HeadlessChrome 0.0.0 (Linux 0.0.0): Executed 537 of 763 (4 FAILED) (0 secs / 9.465 secs)
HeadlessChrome 0.0.0 (Linux 0.0.0): Executed 538 of 763 (4 FAILED) (0 secs / 9.469 secs)
HeadlessChrome 0.0.0 (Linux 0.0.0): Executed 539 of 763 (4 FAILED) (0 secs / 9.473 secs)
HeadlessChrome 0.0.0 (Linux 0.0.0): Executed 540 of 763 (4 FAILED) (0 secs / 9.478 secs)
HeadlessChrome 0.0.0 (Linux 0.0.0): Executed 541 of 763 (4 FAILED) (0 secs / 9.481 secs)
HeadlessChrome 0.0.0 (Linux 0.0.0): Executed 542 of 763 (4 FAILED) (0 secs / 9.486 secs)
HeadlessChrome 0.0.0 (Linux 0.0.0): Executed 543 of 763 (4 FAILED) (0 secs / 9.493 secs)
HeadlessChrome 0.0.0 (Linux 0.0.0): Executed 544 of 763 (4 FAILED) (0 secs / 9.496 secs)
HeadlessChrome 0.0.0 (Linux 0.0.0): Executed 545 of 763 (4 FAILED) (0 secs / 9.5 secs)
HeadlessChrome 0.0.0 (Linux 0.0.0): Executed 546 of 763 (4 FAILED) (0 secs / 9.503 secs)
HeadlessChrome 0.0.0 (Linux 0.0.0): Executed 547 of 763 (4 FAILED) (0 secs / 9.509 secs)
HeadlessChrome 0.0.0 (Linux 0.0.0): Executed 548 of 763 (4 FAILED) (0 secs / 9.513 secs)
HeadlessChrome 0.0.0 (Linux 0.0.0): Executed 549 of 763 (4 FAILED) (0 secs / 9.518 secs)
HeadlessChrome 0.0.0 (Linux 0.0.0): Executed 550 of 763 (4 FAILED) (0 secs / 9.525 secs)
HeadlessChrome 0.0.0 (Linux 0.0.0): Executed 551 of 763 (4 FAILED) (0 secs / 9.529 secs)
HeadlessChrome 0.0.0 (Linux 0.0.0): Executed 552 of 763 (4 FAILED) (0 secs / 9.533 secs)
HeadlessChrome 0.0.0 (Linux 0.0.0): Executed 553 of 763 (4 FAILED) (0 secs / 9.538 secs)
HeadlessChrome 0.0.0 (Linux 0.0.0): Executed 554 of 763 (4 FAILED) (0 secs / 9.542 secs)
HeadlessChrome 0.0.0 (Linux 0.0.0): Executed 555 of 763 (4 FAILED) (0 secs / 9.546 secs)
HeadlessChrome 0.0.0 (Linux 0.0.0): Executed 556 of 763 (4 FAILED) (0 secs / 9.549 secs)
HeadlessChrome 0.0.0 (Linux 0.0.0): Executed 557 of 763 (4 FAILED) (0 secs / 9.551 secs)
HeadlessChrome 0.0.0 (Linux 0.0.0): Executed 558 of 763 (4 FAILED) (0 secs / 9.556 secs)
HeadlessChrome 0.0.0 (Linux 0.0.0): Executed 559 of 763 (4 FAILED) (0 secs / 9.56 secs)
HeadlessChrome 0.0.0 (Linux 0.0.0): Executed 560 of 763 (4 FAILED) (0 secs / 9.564 secs)
HeadlessChrome 0.0.0 (Linux 0.0.0): Executed 561 of 763 (4 FAILED) (0 secs / 9.57 secs)
HeadlessChrome 0.0.0 (Linux 0.0.0): Executed 562 of 763 (4 FAILED) (0 secs / 9.574 secs)
HeadlessChrome 0.0.0 (Linux 0.0.0): Executed 563 of 763 (4 FAILED) (0 secs / 9.576 secs)
HeadlessChrome 0.0.0 (Linux 0.0.0): Executed 564 of 763 (4 FAILED) (0 secs / 9.58 secs)
HeadlessChrome 0.0.0 (Linux 0.0.0): Executed 565 of 763 (4 FAILED) (0 secs / 9.585 secs)
HeadlessChrome 0.0.0 (Linux 0.0.0): Executed 566 of 763 (4 FAILED) (0 secs / 9.59 secs)
HeadlessChrome 0.0.0 (Linux 0.0.0): Executed 567 of 763 (4 FAILED) (0 secs / 9.597 secs)
HeadlessChrome 0.0.0 (Linux 0.0.0): Executed 568 of 763 (4 FAILED) (0 secs / 9.601 secs)
HeadlessChrome 0.0.0 (Linux 0.0.0): Executed 569 of 763 (4 FAILED) (0 secs / 9.606 secs)
HeadlessChrome 0.0.0 (Linux 0.0.0): Executed 570 of 763 (4 FAILED) (0 secs / 9.609 secs)
HeadlessChrome 0.0.0 (Linux 0.0.0): Executed 571 of 763 (4 FAILED) (0 secs / 9.614 secs)
HeadlessChrome 0.0.0 (Linux 0.0.0): Executed 572 of 763 (4 FAILED) (0 secs / 9.618 secs)
HeadlessChrome 0.0.0 (Linux 0.0.0): Executed 573 of 763 (4 FAILED) (0 secs / 9.625 secs)
HeadlessChrome 0.0.0 (Linux 0.0.0): Executed 574 of 763 (4 FAILED) (0 secs / 9.628 secs)
HeadlessChrome 0.0.0 (Linux 0.0.0): Executed 575 of 763 (4 FAILED) (0 secs / 9.631 secs)
HeadlessChrome 0.0.0 (Linux 0.0.0): Executed 576 of 763 (4 FAILED) (0 secs / 9.636 secs)
HeadlessChrome 0.0.0 (Linux 0.0.0): Executed 577 of 763 (4 FAILED) (0 secs / 9.639 secs)
HeadlessChrome 0.0.0 (Linux 0.0.0): Executed 578 of 763 (4 FAILED) (0 secs / 9.642 secs)
HeadlessChrome 0.0.0 (Linux 0.0.0): Executed 579 of 763 (4 FAILED) (0 secs / 9.644 secs)
HeadlessChrome 0.0.0 (Linux 0.0.0): Executed 580 of 763 (4 FAILED) (0 secs / 9.645 secs)
HeadlessChrome 0.0.0 (Linux 0.0.0): Executed 581 of 763 (4 FAILED) (0 secs / 9.647 secs)
HeadlessChrome 0.0.0 (Linux 0.0.0): Executed 582 of 763 (4 FAILED) (0 secs / 9.651 secs)
HeadlessChrome 0.0.0 (Linux 0.0.0): Executed 583 of 763 (4 FAILED) (0 secs / 9.653 secs)
HeadlessChrome 0.0.0 (Linux 0.0.0): Executed 584 of 763 (4 FAILED) (0 secs / 9.655 secs)
HeadlessChrome 0.0.0 (Linux 0.0.0): Executed 585 of 763 (4 FAILED) (0 secs / 9.656 secs)
HeadlessChrome 0.0.0 (Linux 0.0.0): Executed 586 of 763 (4 FAILED) (0 secs / 9.657 secs)
HeadlessChrome 0.0.0 (Linux 0.0.0): Executed 587 of 763 (4 FAILED) (0 secs / 9.658 secs)
HeadlessChrome 0.0.0 (Linux 0.0.0): Executed 588 of 763 (4 FAILED) (0 secs / 9.659 secs)
HeadlessChrome 0.0.0 (Linux 0.0.0): Executed 589 of 763 (4 FAILED) (0 secs / 9.661 secs)
HeadlessChrome 0.0.0 (Linux 0.0.0): Executed 590 of 763 (4 FAILED) (0 secs / 9.665 secs)
HeadlessChrome 0.0.0 (Linux 0.0.0): Executed 591 of 763 (4 FAILED) (0 secs / 9.666 secs)
HeadlessChrome 0.0.0 (Linux 0.0.0): Executed 592 of 763 (4 FAILED) (0 secs / 9.668 secs)
HeadlessChrome 0.0.0 (Linux 0.0.0): Executed 593 of 763 (4 FAILED) (0 secs / 9.67 secs)
HeadlessChrome 0.0.0 (Linux 0.0.0): Executed 594 of 763 (4 FAILED) (0 secs / 9.672 secs)
HeadlessChrome 0.0.0 (Linux 0.0.0): Executed 595 of 763 (4 FAILED) (0 secs / 9.673 secs)
HeadlessChrome 0.0.0 (Linux 0.0.0): Executed 596 of 763 (4 FAILED) (0 secs / 9.676 secs)
HeadlessChrome 0.0.0 (Linux 0.0.0): Executed 597 of 763 (4 FAILED) (0 secs / 9.678 secs)
HeadlessChrome 0.0.0 (Linux 0.0.0): Executed 598 of 763 (4 FAILED) (0 secs / 9.68 secs)
HeadlessChrome 0.0.0 (Linux 0.0.0): Executed 599 of 763 (4 FAILED) (0 secs / 9.681 secs)
HeadlessChrome 0.0.0 (Linux 0.0.0): Executed 600 of 763 (4 FAILED) (0 secs / 9.682 secs)
HeadlessChrome 0.0.0 (Linux 0.0.0): Executed 601 of 763 (4 FAILED) (0 secs / 9.685 secs)
HeadlessChrome 0.0.0 (Linux 0.0.0): Executed 602 of 763 (4 FAILED) (0 secs / 9.686 secs)
HeadlessChrome 0.0.0 (Linux 0.0.0): Executed 603 of 763 (4 FAILED) (0 secs / 9.688 secs)
HeadlessChrome 0.0.0 (Linux 0.0.0): Executed 604 of 763 (4 FAILED) (0 secs / 9.692 secs)
HeadlessChrome 0.0.0 (Linux 0.0.0): Executed 605 of 763 (4 FAILED) (0 secs / 9.694 secs)
HeadlessChrome 0.0.0 (Linux 0.0.0): Executed 606 of 763 (4 FAILED) (0 secs / 9.696 secs)
HeadlessChrome 0.0.0 (Linux 0.0.0): Executed 607 of 763 (4 FAILED) (0 secs / 9.697 secs)
HeadlessChrome 0.0.0 (Linux 0.0.0): Executed 608 of 763 (4 FAILED) (0 secs / 9.699 secs)
HeadlessChrome 0.0.0 (Linux 0.0.0): Executed 609 of 763 (4 FAILED) (0 secs / 9.7 secs)
HeadlessChrome 0.0.0 (Linux 0.0.0): Executed 610 of 763 (4 FAILED) (0 secs / 9.702 secs)
HeadlessChrome 0.0.0 (Linux 0.0.0): Executed 611 of 763 (4 FAILED) (0 secs / 9.703 secs)
HeadlessChrome 0.0.0 (Linux 0.0.0): Executed 612 of 763 (4 FAILED) (0 secs / 9.707 secs)
HeadlessChrome 0.0.0 (Linux 0.0.0): Executed 613 of 763 (4 FAILED) (0 secs / 9.708 secs)
HeadlessChrome 0.0.0 (Linux 0.0.0): Executed 614 of 763 (4 FAILED) (0 secs / 9.71 secs)
HeadlessChrome 0.0.0 (Linux 0.0.0): Executed 615 of 763 (4 FAILED) (0 secs / 9.711 secs)
HeadlessChrome 0.0.0 (Linux 0.0.0): Executed 616 of 763 (4 FAILED) (0 secs / 9.714 secs)
HeadlessChrome 0.0.0 (Linux 0.0.0): Executed 617 of 763 (4 FAILED) (0 secs / 9.717 secs)
HeadlessChrome 0.0.0 (Linux 0.0.0): Executed 618 of 763 (4 FAILED) (0 secs / 9.719 secs)
HeadlessChrome 0.0.0 (Linux 0.0.0): Executed 619 of 763 (4 FAILED) (0 secs / 9.722 secs)
HeadlessChrome 0.0.0 (Linux 0.0.0): Executed 620 of 763 (4 FAILED) (0 secs / 9.73 secs)
HeadlessChrome 0.0.0 (Linux 0.0.0): Executed 621 of 763 (4 FAILED) (0 secs / 9.73 secs)
HeadlessChrome 0.0.0 (Linux 0.0.0): Executed 622 of 763 (4 FAILED) (0 secs / 9.733 secs)
HeadlessChrome 0.0.0 (Linux 0.0.0): Executed 623 of 763 (4 FAILED) (0 secs / 9.736 secs)
HeadlessChrome 0.0.0 (Linux 0.0.0): Executed 624 of 763 (4 FAILED) (0 secs / 9.738 secs)
HeadlessChrome 0.0.0 (Linux 0.0.0): Executed 625 of 763 (4 FAILED) (0 secs / 9.74 secs)
HeadlessChrome 0.0.0 (Linux 0.0.0): Executed 626 of 763 (4 FAILED) (0 secs / 9.741 secs)
HeadlessChrome 0.0.0 (Linux 0.0.0): Executed 627 of 763 (4 FAILED) (0 secs / 9.744 secs)
HeadlessChrome 0.0.0 (Linux 0.0.0): Executed 628 of 763 (4 FAILED) (0 secs / 9.746 secs)
HeadlessChrome 0.0.0 (Linux 0.0.0): Executed 629 of 763 (4 FAILED) (0 secs / 9.747 secs)
HeadlessChrome 0.0.0 (Linux 0.0.0): Executed 630 of 763 (4 FAILED) (0 secs / 9.751 secs)
HeadlessChrome 0.0.0 (Linux 0.0.0): Executed 631 of 763 (4 FAILED) (0 secs / 9.753 secs)
HeadlessChrome 0.0.0 (Linux 0.0.0): Executed 632 of 763 (4 FAILED) (0 secs / 9.755 secs)
HeadlessChrome 0.0.0 (Linux 0.0.0): Executed 633 of 763 (4 FAILED) (0 secs / 9.757 secs)
HeadlessChrome 0.0.0 (Linux 0.0.0): Executed 634 of 763 (4 FAILED) (0 secs / 9.759 secs)
HeadlessChrome 0.0.0 (Linux 0.0.0): Executed 635 of 763 (4 FAILED) (0 secs / 9.762 secs)
HeadlessChrome 0.0.0 (Linux 0.0.0): Executed 636 of 763 (4 FAILED) (0 secs / 9.763 secs)
HeadlessChrome 0.0.0 (Linux 0.0.0): Executed 637 of 763 (4 FAILED) (0 secs / 9.764 secs)
HeadlessChrome 0.0.0 (Linux 0.0.0): Executed 638 of 763 (4 FAILED) (0 secs / 9.766 secs)
HeadlessChrome 0.0.0 (Linux 0.0.0): Executed 639 of 763 (4 FAILED) (0 secs / 9.767 secs)
HeadlessChrome 0.0.0 (Linux 0.0.0): Executed 640 of 763 (4 FAILED) (0 secs / 9.769 secs)
HeadlessChrome 0.0.0 (Linux 0.0.0): Executed 641 of 763 (4 FAILED) (0 secs / 9.771 secs)
HeadlessChrome 0.0.0 (Linux 0.0.0): Executed 642 of 763 (4 FAILED) (0 secs / 9.773 secs)
HeadlessChrome 0.0.0 (Linux 0.0.0): Executed 643 of 763 (4 FAILED) (0 secs / 9.774 secs)
HeadlessChrome 0.0.0 (Linux 0.0.0): Executed 644 of 763 (4 FAILED) (0 secs / 9.779 secs)
HeadlessChrome 0.0.0 (Linux 0.0.0): Executed 645 of 763 (4 FAILED) (0 secs / 9.781 secs)
HeadlessChrome 0.0.0 (Linux 0.0.0): Executed 646 of 763 (4 FAILED) (0 secs / 9.782 secs)
HeadlessChrome 0.0.0 (Linux 0.0.0): Executed 647 of 763 (4 FAILED) (0 secs / 9.783 secs)
HeadlessChrome 0.0.0 (Linux 0.0.0): Executed 648 of 763 (4 FAILED) (0 secs / 9.785 secs)
HeadlessChrome 0.0.0 (Linux 0.0.0): Executed 649 of 763 (4 FAILED) (0 secs / 9.789 secs)
HeadlessChrome 0.0.0 (Linux 0.0.0): Executed 650 of 763 (4 FAILED) (0 secs / 9.79 secs)
HeadlessChrome 0.0.0 (Linux 0.0.0): Executed 651 of 763 (4 FAILED) (0 secs / 9.792 secs)
HeadlessChrome 0.0.0 (Linux 0.0.0): Executed 652 of 763 (4 FAILED) (0 secs / 9.794 secs)
HeadlessChrome 0.0.0 (Linux 0.0.0): Executed 653 of 763 (4 FAILED) (0 secs / 9.796 secs)
HeadlessChrome 0.0.0 (Linux 0.0.0): Executed 654 of 763 (4 FAILED) (0 secs / 9.798 secs)
HeadlessChrome 0.0.0 (Linux 0.0.0): Executed 655 of 763 (4 FAILED) (0 secs / 9.8 secs)
HeadlessChrome 0.0.0 (Linux 0.0.0): Executed 656 of 763 (4 FAILED) (0 secs / 9.802 secs)
HeadlessChrome 0.0.0 (Linux 0.0.0): Executed 657 of 763 (4 FAILED) (0 secs / 9.804 secs)
HeadlessChrome 0.0.0 (Linux 0.0.0): Executed 658 of 763 (4 FAILED) (0 secs / 9.806 secs)
HeadlessChrome 0.0.0 (Linux 0.0.0): Executed 659 of 763 (4 FAILED) (0 secs / 9.808 secs)
HeadlessChrome 0.0.0 (Linux 0.0.0): Executed 660 of 763 (4 FAILED) (0 secs / 9.81 secs)
HeadlessChrome 0.0.0 (Linux 0.0.0): Executed 661 of 763 (4 FAILED) (0 secs / 9.811 secs)
HeadlessChrome 0.0.0 (Linux 0.0.0): Executed 662 of 763 (4 FAILED) (0 secs / 9.813 secs)
HeadlessChrome 0.0.0 (Linux 0.0.0): Executed 663 of 763 (4 FAILED) (0 secs / 9.815 secs)
HeadlessChrome 0.0.0 (Linux 0.0.0): Executed 664 of 763 (4 FAILED) (0 secs / 9.817 secs)
HeadlessChrome 0.0.0 (Linux 0.0.0): Executed 665 of 763 (4 FAILED) (0 secs / 9.818 secs)
HeadlessChrome 0.0.0 (Linux 0.0.0): Executed 666 of 763 (4 FAILED) (0 secs / 9.82 secs)
HeadlessChrome 0.0.0 (Linux 0.0.0): Executed 667 of 763 (4 FAILED) (0 secs / 9.822 secs)
HeadlessChrome 0.0.0 (Linux 0.0.0): Executed 668 of 763 (4 FAILED) (0 secs / 9.824 secs)
HeadlessChrome 0.0.0 (Linux 0.0.0): Executed 669 of 763 (4 FAILED) (0 secs / 9.825 secs)
HeadlessChrome 0.0.0 (Linux 0.0.0): Executed 670 of 763 (4 FAILED) (0 secs / 9.826 secs)
HeadlessChrome 0.0.0 (Linux 0.0.0): Executed 671 of 763 (4 FAILED) (0 secs / 9.83 secs)
HeadlessChrome 0.0.0 (Linux 0.0.0): Executed 672 of 763 (4 FAILED) (0 secs / 9.831 secs)
HeadlessChrome 0.0.0 (Linux 0.0.0): Executed 673 of 763 (4 FAILED) (0 secs / 9.833 secs)
HeadlessChrome 0.0.0 (Linux 0.0.0): Executed 674 of 763 (4 FAILED) (0 secs / 9.835 secs)
HeadlessChrome 0.0.0 (Linux 0.0.0): Executed 675 of 763 (4 FAILED) (0 secs / 9.837 secs)
HeadlessChrome 0.0.0 (Linux 0.0.0): Executed 676 of 763 (4 FAILED) (0 secs / 9.84 secs)
HeadlessChrome 0.0.0 (Linux 0.0.0): Executed 677 of 763 (4 FAILED) (0 secs / 9.845 secs)
HeadlessChrome 0.0.0 (Linux 0.0.0): Executed 678 of 763 (4 FAILED) (0 secs / 9.848 secs)
HeadlessChrome 0.0.0 (Linux 0.0.0): Executed 679 of 763 (4 FAILED) (0 secs / 9.851 secs)
HeadlessChrome 0.0.0 (Linux 0.0.0): Executed 680 of 763 (4 FAILED) (0 secs / 9.874 secs)
HeadlessChrome 0.0.0 (Linux 0.0.0): Executed 681 of 763 (4 FAILED) (0 secs / 9.877 secs)
HeadlessChrome 0.0.0 (Linux 0.0.0): Executed 682 of 763 (4 FAILED) (0 secs / 9.879 secs)
HeadlessChrome 0.0.0 (Linux 0.0.0): Executed 683 of 763 (4 FAILED) (0 secs / 9.902 secs)
HeadlessChrome 0.0.0 (Linux 0.0.0): Executed 684 of 763 (4 FAILED) (0 secs / 9.905 secs)
HeadlessChrome 0.0.0 (Linux 0.0.0): Executed 685 of 763 (4 FAILED) (0 secs / 9.908 secs)
HeadlessChrome 0.0.0 (Linux 0.0.0): Executed 686 of 763 (4 FAILED) (0 secs / 9.911 secs)
HeadlessChrome 0.0.0 (Linux 0.0.0): Executed 687 of 763 (4 FAILED) (0 secs / 9.932 secs)
HeadlessChrome 0.0.0 (Linux 0.0.0): Executed 688 of 763 (4 FAILED) (0 secs / 9.936 secs)
HeadlessChrome 0.0.0 (Linux 0.0.0): Executed 689 of 763 (4 FAILED) (0 secs / 9.939 secs)
HeadlessChrome 0.0.0 (Linux 0.0.0): Executed 690 of 763 (4 FAILED) (0 secs / 9.961 secs)
HeadlessChrome 0.0.0 (Linux 0.0.0): Executed 691 of 763 (4 FAILED) (0 secs / 9.964 secs)
HeadlessChrome 0.0.0 (Linux 0.0.0): Executed 692 of 763 (4 FAILED) (0 secs / 9.965 secs)
HeadlessChrome 0.0.0 (Linux 0.0.0): Executed 693 of 763 (4 FAILED) (0 secs / 9.971 secs)
HeadlessChrome 0.0.0 (Linux 0.0.0): Executed 694 of 763 (4 FAILED) (0 secs / 9.973 secs)
HeadlessChrome 0.0.0 (Linux 0.0.0): Executed 695 of 763 (4 FAILED) (0 secs / 9.975 secs)
HeadlessChrome 0.0.0 (Linux 0.0.0): Executed 696 of 763 (4 FAILED) (0 secs / 9.977 secs)
HeadlessChrome 0.0.0 (Linux 0.0.0): Executed 697 of 763 (4 FAILED) (0 secs / 9.977 secs)
HeadlessChrome 0.0.0 (Linux 0.0.0): Executed 698 of 763 (4 FAILED) (0 secs / 9.98 secs)
HeadlessChrome 0.0.0 (Linux 0.0.0): Executed 699 of 763 (4 FAILED) (0 secs / 9.983 secs)
HeadlessChrome 0.0.0 (Linux 0.0.0): Executed 700 of 763 (4 FAILED) (0 secs / 9.985 secs)
HeadlessChrome 0.0.0 (Linux 0.0.0): Executed 701 of 763 (4 FAILED) (0 secs / 9.987 secs)
HeadlessChrome 0.0.0 (Linux 0.0.0): Executed 702 of 763 (4 FAILED) (0 secs / 9.989 secs)
HeadlessChrome 0.0.0 (Linux 0.0.0): Executed 703 of 763 (4 FAILED) (0 secs / 9.991 secs)
HeadlessChrome 0.0.0 (Linux 0.0.0): Executed 704 of 763 (4 FAILED) (0 secs / 9.993 secs)
HeadlessChrome 0.0.0 (Linux 0.0.0): Executed 705 of 763 (4 FAILED) (0 secs / 9.998 secs)
HeadlessChrome 0.0.0 (Linux 0.0.0): Executed 706 of 763 (4 FAILED) (0 secs / 10 secs)
HeadlessChrome 0.0.0 (Linux 0.0.0): Executed 707 of 763 (4 FAILED) (0 secs / 10.001 secs)
HeadlessChrome 0.0.0 (Linux 0.0.0): Executed 708 of 763 (4 FAILED) (0 secs / 10.002 secs)
HeadlessChrome 0.0.0 (Linux 0.0.0): Executed 709 of 763 (4 FAILED) (0 secs / 10.004 secs)
HeadlessChrome 0.0.0 (Linux 0.0.0): Executed 710 of 763 (4 FAILED) (0 secs / 10.006 secs)
HeadlessChrome 0.0.0 (Linux 0.0.0): Executed 711 of 763 (4 FAILED) (0 secs / 10.007 secs)
HeadlessChrome 0.0.0 (Linux 0.0.0): Executed 712 of 763 (4 FAILED) (0 secs / 10.009 secs)
HeadlessChrome 0.0.0 (Linux 0.0.0): Executed 713 of 763 (4 FAILED) (0 secs / 10.012 secs)
HeadlessChrome 0.0.0 (Linux 0.0.0): Executed 714 of 763 (4 FAILED) (0 secs / 10.034 secs)
HeadlessChrome 0.0.0 (Linux 0.0.0): Executed 715 of 763 (4 FAILED) (0 secs / 10.035 secs)
HeadlessChrome 0.0.0 (Linux 0.0.0): Executed 716 of 763 (4 FAILED) (0 secs / 10.057 secs)
HeadlessChrome 0.0.0 (Linux 0.0.0): Executed 717 of 763 (4 FAILED) (0 secs / 10.061 secs)
HeadlessChrome 0.0.0 (Linux 0.0.0): Executed 718 of 763 (4 FAILED) (0 secs / 10.063 secs)
HeadlessChrome 0.0.0 (Linux 0.0.0): Executed 719 of 763 (4 FAILED) (0 secs / 10.064 secs)
HeadlessChrome 0.0.0 (Linux 0.0.0): Executed 720 of 763 (4 FAILED) (0 secs / 10.067 secs)
HeadlessChrome 0.0.0 (Linux 0.0.0): Executed 721 of 763 (4 FAILED) (0 secs / 10.069 secs)
HeadlessChrome 0.0.0 (Linux 0.0.0): Executed 722 of 763 (4 FAILED) (0 secs / 10.07 secs)
HeadlessChrome 0.0.0 (Linux 0.0.0): Executed 723 of 763 (4 FAILED) (0 secs / 10.071 secs)
HeadlessChrome 0.0.0 (Linux 0.0.0): Executed 724 of 763 (4 FAILED) (0 secs / 10.074 secs)
HeadlessChrome 0.0.0 (Linux 0.0.0): Executed 725 of 763 (4 FAILED) (0 secs / 10.075 secs)
HeadlessChrome 0.0.0 (Linux 0.0.0): Executed 726 of 763 (4 FAILED) (0 secs / 10.077 secs)
HeadlessChrome 0.0.0 (Linux 0.0.0): Executed 727 of 763 (4 FAILED) (0 secs / 10.078 secs)
HeadlessChrome 0.0.0 (Linux 0.0.0): Executed 728 of 763 (4 FAILED) (0 secs / 10.08 secs)
HeadlessChrome 0.0.0 (Linux 0.0.0): Executed 729 of 763 (4 FAILED) (0 secs / 10.082 secs)
HeadlessChrome 0.0.0 (Linux 0.0.0): Executed 730 of 763 (4 FAILED) (0 secs / 10.082 secs)
HeadlessChrome 0.0.0 (Linux 0.0.0): Executed 731 of 763 (4 FAILED) (0 secs / 10.083 secs)
HeadlessChrome 0.0.0 (Linux 0.0.0): Executed 732 of 763 (4 FAILED) (0 secs / 10.085 secs)
HeadlessChrome 0.0.0 (Linux 0.0.0): Executed 733 of 763 (4 FAILED) (0 secs / 10.089 secs)
HeadlessChrome 0.0.0 (Linux 0.0.0): Executed 734 of 763 (4 FAILED) (0 secs / 10.09 secs)
HeadlessChrome 0.0.0 (Linux 0.0.0): Executed 735 of 763 (4 FAILED) (0 secs / 10.091 secs)
HeadlessChrome 0.0.0 (Linux 0.0.0): Executed 736 of 763 (4 FAILED) (0 secs / 10.093 secs)
HeadlessChrome 0.0.0 (Linux 0.0.0): Executed 737 of 763 (4 FAILED) (0 secs / 10.095 secs)
HeadlessChrome 0.0.0 (Linux 0.0.0): Executed 738 of 763 (4 FAILED) (0 secs / 10.097 secs)
HeadlessChrome 0.0.0 (Linux 0.0.0): Executed 739 of 763 (4 FAILED) (0 secs / 10.098 secs)
HeadlessChrome 0.0.0 (Linux 0.0.0): Executed 740 of 763 (4 FAILED) (0 secs / 10.101 secs)
HeadlessChrome 0.0.0 (Linux 0.0.0): Executed 741 of 763 (4 FAILED) (0 secs / 10.109 secs)
HeadlessChrome 0.0.0 (Linux 0.0.0): Executed 742 of 763 (4 FAILED) (0 secs / 10.11 secs)
HeadlessChrome 0.0.0 (Linux 0.0.0): Executed 743 of 763 (4 FAILED) (0 secs / 10.111 secs)
HeadlessChrome 0.0.0 (Linux 0.0.0): Executed 744 of 763 (4 FAILED) (0 secs / 10.116 secs)
HeadlessChrome 0.0.0 (Linux 0.0.0): Executed 745 of 763 (4 FAILED) (0 secs / 10.118 secs)
HeadlessChrome 0.0.0 (Linux 0.0.0): Executed 746 of 763 (4 FAILED) (0 secs / 10.119 secs)
HeadlessChrome 0.0.0 (Linux 0.0.0): Executed 747 of 763 (4 FAILED) (0 secs / 10.12 secs)
HeadlessChrome 0.0.0 (Linux 0.0.0): Executed 748 of 763 (4 FAILED) (0 secs / 10.121 secs)
HeadlessChrome 0.0.0 (Linux 0.0.0): Executed 749 of 763 (4 FAILED) (0 secs / 10.124 secs)
HeadlessChrome 0.0.0 (Linux 0.0.0): Executed 750 of 763 (4 FAILED) (0 secs / 10.125 secs)
HeadlessChrome 0.0.0 (Linux 0.0.0): Executed 751 of 763 (4 FAILED) (0 secs / 10.127 secs)
HeadlessChrome 0.0.0 (Linux 0.0.0): Executed 752 of 763 (4 FAILED) (0 secs / 10.132 secs)
HeadlessChrome 0.0.0 (Linux 0.0.0): Executed 753 of 763 (4 FAILED) (0 secs / 10.136 secs)
HeadlessChrome 0.0.0 (Linux 0.0.0): Executed 754 of 763 (4 FAILED) (0 secs / 10.137 secs)
HeadlessChrome 0.0.0 (Linux 0.0.0): Executed 755 of 763 (4 FAILED) (0 secs / 10.14 secs)
HeadlessChrome 0.0.0 (Linux 0.0.0): Executed 756 of 763 (4 FAILED) (0 secs / 10.14 secs)
HeadlessChrome 0.0.0 (Linux 0.0.0): Executed 757 of 763 (4 FAILED) (0 secs / 10.142 secs)
HeadlessChrome 0.0.0 (Linux 0.0.0): Executed 758 of 763 (4 FAILED) (0 secs / 10.146 secs)
HeadlessChrome 0.0.0 (Linux 0.0.0): Executed 759 of 763 (4 FAILED) (0 secs / 10.147 secs)
HeadlessChrome 0.0.0 (Linux 0.0.0): Executed 760 of 763 (4 FAILED) (0 secs / 10.148 secs)
HeadlessChrome 0.0.0 (Linux 0.0.0): Executed 761 of 763 (4 FAILED) (0 secs / 10.15 secs)
HeadlessChrome 0.0.0 (Linux 0.0.0): Executed 762 of 763 (4 FAILED) (0 secs / 10.152 secs)
HeadlessChrome 0.0.0 (Linux 0.0.0): Executed 763 of 763 (4 FAILED) (0 secs / 10.154 secs)
HeadlessChrome 0.0.0 (Linux 0.0.0): Executed 763 of 763 (4 FAILED) (10.524 secs / 10.154 secs)
ERROR: Error detected when running the Jasmine tests.
ERROR: Error detected when running the Jasmine tests.
Build step 'Execute shell' marked build as failure

Reply | Threaded
Open this post in threaded view
|

Build failed in Jenkins: pgadmin4-master-python34 #851

pgAdmin 4 Jenkins
See <https://jenkins.pgadmin.org/job/pgadmin4-master-python34/851/display/redirect?page=changes>

Changes:

[Dave Page] Don't show system catalogs in the schemas property list unless show

[Dave Page] Ensure the context menu works after a server is renamed. Fixes #3575

------------------------------------------
[...truncated 1012.97 KB...]
HeadlessChrome 0.0.0 (Linux 0.0.0): Executed 519 of 763 (4 FAILED) (0 secs / 9.527 secs)
HeadlessChrome 0.0.0 (Linux 0.0.0): Executed 520 of 763 (4 FAILED) (0 secs / 9.53 secs)
HeadlessChrome 0.0.0 (Linux 0.0.0): Executed 521 of 763 (4 FAILED) (0 secs / 9.534 secs)
HeadlessChrome 0.0.0 (Linux 0.0.0): Executed 522 of 763 (4 FAILED) (0 secs / 9.54 secs)
HeadlessChrome 0.0.0 (Linux 0.0.0): Executed 523 of 763 (4 FAILED) (0 secs / 9.544 secs)
HeadlessChrome 0.0.0 (Linux 0.0.0): Executed 524 of 763 (4 FAILED) (0 secs / 9.547 secs)
HeadlessChrome 0.0.0 (Linux 0.0.0): Executed 525 of 763 (4 FAILED) (0 secs / 9.549 secs)
HeadlessChrome 0.0.0 (Linux 0.0.0): Executed 526 of 763 (4 FAILED) (0 secs / 9.558 secs)
HeadlessChrome 0.0.0 (Linux 0.0.0): Executed 527 of 763 (4 FAILED) (0 secs / 9.561 secs)
HeadlessChrome 0.0.0 (Linux 0.0.0): Executed 528 of 763 (4 FAILED) (0 secs / 9.563 secs)
HeadlessChrome 0.0.0 (Linux 0.0.0): Executed 529 of 763 (4 FAILED) (0 secs / 9.566 secs)
HeadlessChrome 0.0.0 (Linux 0.0.0): Executed 530 of 763 (4 FAILED) (0 secs / 9.57 secs)
HeadlessChrome 0.0.0 (Linux 0.0.0): Executed 531 of 763 (4 FAILED) (0 secs / 9.574 secs)
HeadlessChrome 0.0.0 (Linux 0.0.0): Executed 532 of 763 (4 FAILED) (0 secs / 9.576 secs)
HeadlessChrome 0.0.0 (Linux 0.0.0): Executed 533 of 763 (4 FAILED) (0 secs / 9.578 secs)
HeadlessChrome 0.0.0 (Linux 0.0.0): Executed 534 of 763 (4 FAILED) (0 secs / 9.583 secs)
HeadlessChrome 0.0.0 (Linux 0.0.0): Executed 535 of 763 (4 FAILED) (0 secs / 9.59 secs)
HeadlessChrome 0.0.0 (Linux 0.0.0): Executed 536 of 763 (4 FAILED) (0 secs / 9.594 secs)
HeadlessChrome 0.0.0 (Linux 0.0.0): Executed 537 of 763 (4 FAILED) (0 secs / 9.598 secs)
HeadlessChrome 0.0.0 (Linux 0.0.0): Executed 538 of 763 (4 FAILED) (0 secs / 9.601 secs)
HeadlessChrome 0.0.0 (Linux 0.0.0): Executed 539 of 763 (4 FAILED) (0 secs / 9.607 secs)
HeadlessChrome 0.0.0 (Linux 0.0.0): Executed 540 of 763 (4 FAILED) (0 secs / 9.611 secs)
HeadlessChrome 0.0.0 (Linux 0.0.0): Executed 541 of 763 (4 FAILED) (0 secs / 9.616 secs)
HeadlessChrome 0.0.0 (Linux 0.0.0): Executed 542 of 763 (4 FAILED) (0 secs / 9.627 secs)
HeadlessChrome 0.0.0 (Linux 0.0.0): Executed 543 of 763 (4 FAILED) (0 secs / 9.634 secs)
HeadlessChrome 0.0.0 (Linux 0.0.0): Executed 544 of 763 (4 FAILED) (0 secs / 9.639 secs)
HeadlessChrome 0.0.0 (Linux 0.0.0): Executed 545 of 763 (4 FAILED) (0 secs / 9.643 secs)
HeadlessChrome 0.0.0 (Linux 0.0.0): Executed 546 of 763 (4 FAILED) (0 secs / 9.648 secs)
HeadlessChrome 0.0.0 (Linux 0.0.0): Executed 547 of 763 (4 FAILED) (0 secs / 9.654 secs)
HeadlessChrome 0.0.0 (Linux 0.0.0): Executed 548 of 763 (4 FAILED) (0 secs / 9.658 secs)
HeadlessChrome 0.0.0 (Linux 0.0.0): Executed 549 of 763 (4 FAILED) (0 secs / 9.663 secs)
HeadlessChrome 0.0.0 (Linux 0.0.0): Executed 550 of 763 (4 FAILED) (0 secs / 9.67 secs)
HeadlessChrome 0.0.0 (Linux 0.0.0): Executed 551 of 763 (4 FAILED) (0 secs / 9.675 secs)
HeadlessChrome 0.0.0 (Linux 0.0.0): Executed 552 of 763 (4 FAILED) (0 secs / 9.68 secs)
HeadlessChrome 0.0.0 (Linux 0.0.0): Executed 553 of 763 (4 FAILED) (0 secs / 9.683 secs)
HeadlessChrome 0.0.0 (Linux 0.0.0): Executed 554 of 763 (4 FAILED) (0 secs / 9.687 secs)
HeadlessChrome 0.0.0 (Linux 0.0.0): Executed 555 of 763 (4 FAILED) (0 secs / 9.691 secs)
HeadlessChrome 0.0.0 (Linux 0.0.0): Executed 556 of 763 (4 FAILED) (0 secs / 9.694 secs)
HeadlessChrome 0.0.0 (Linux 0.0.0): Executed 557 of 763 (4 FAILED) (0 secs / 9.696 secs)
HeadlessChrome 0.0.0 (Linux 0.0.0): Executed 558 of 763 (4 FAILED) (0 secs / 9.701 secs)
HeadlessChrome 0.0.0 (Linux 0.0.0): Executed 559 of 763 (4 FAILED) (0 secs / 9.704 secs)
HeadlessChrome 0.0.0 (Linux 0.0.0): Executed 560 of 763 (4 FAILED) (0 secs / 9.708 secs)
HeadlessChrome 0.0.0 (Linux 0.0.0): Executed 561 of 763 (4 FAILED) (0 secs / 9.712 secs)
HeadlessChrome 0.0.0 (Linux 0.0.0): Executed 562 of 763 (4 FAILED) (0 secs / 9.717 secs)
HeadlessChrome 0.0.0 (Linux 0.0.0): Executed 563 of 763 (4 FAILED) (0 secs / 9.719 secs)
HeadlessChrome 0.0.0 (Linux 0.0.0): Executed 564 of 763 (4 FAILED) (0 secs / 9.722 secs)
HeadlessChrome 0.0.0 (Linux 0.0.0): Executed 565 of 763 (4 FAILED) (0 secs / 9.726 secs)
HeadlessChrome 0.0.0 (Linux 0.0.0): Executed 566 of 763 (4 FAILED) (0 secs / 9.732 secs)
HeadlessChrome 0.0.0 (Linux 0.0.0): Executed 567 of 763 (4 FAILED) (0 secs / 9.739 secs)
HeadlessChrome 0.0.0 (Linux 0.0.0): Executed 568 of 763 (4 FAILED) (0 secs / 9.741 secs)
HeadlessChrome 0.0.0 (Linux 0.0.0): Executed 569 of 763 (4 FAILED) (0 secs / 9.744 secs)
HeadlessChrome 0.0.0 (Linux 0.0.0): Executed 570 of 763 (4 FAILED) (0 secs / 9.749 secs)
HeadlessChrome 0.0.0 (Linux 0.0.0): Executed 571 of 763 (4 FAILED) (0 secs / 9.756 secs)
HeadlessChrome 0.0.0 (Linux 0.0.0): Executed 572 of 763 (4 FAILED) (0 secs / 9.761 secs)
HeadlessChrome 0.0.0 (Linux 0.0.0): Executed 573 of 763 (4 FAILED) (0 secs / 9.766 secs)
HeadlessChrome 0.0.0 (Linux 0.0.0): Executed 574 of 763 (4 FAILED) (0 secs / 9.771 secs)
HeadlessChrome 0.0.0 (Linux 0.0.0): Executed 575 of 763 (4 FAILED) (0 secs / 9.774 secs)
HeadlessChrome 0.0.0 (Linux 0.0.0): Executed 576 of 763 (4 FAILED) (0 secs / 9.778 secs)
HeadlessChrome 0.0.0 (Linux 0.0.0): Executed 577 of 763 (4 FAILED) (0 secs / 9.784 secs)
HeadlessChrome 0.0.0 (Linux 0.0.0): Executed 578 of 763 (4 FAILED) (0 secs / 9.786 secs)
HeadlessChrome 0.0.0 (Linux 0.0.0): Executed 579 of 763 (4 FAILED) (0 secs / 9.789 secs)
HeadlessChrome 0.0.0 (Linux 0.0.0): Executed 580 of 763 (4 FAILED) (0 secs / 9.79 secs)
HeadlessChrome 0.0.0 (Linux 0.0.0): Executed 581 of 763 (4 FAILED) (0 secs / 9.792 secs)
HeadlessChrome 0.0.0 (Linux 0.0.0): Executed 582 of 763 (4 FAILED) (0 secs / 9.796 secs)
HeadlessChrome 0.0.0 (Linux 0.0.0): Executed 583 of 763 (4 FAILED) (0 secs / 9.797 secs)
HeadlessChrome 0.0.0 (Linux 0.0.0): Executed 584 of 763 (4 FAILED) (0 secs / 9.798 secs)
HeadlessChrome 0.0.0 (Linux 0.0.0): Executed 585 of 763 (4 FAILED) (0 secs / 9.8 secs)
HeadlessChrome 0.0.0 (Linux 0.0.0): Executed 586 of 763 (4 FAILED) (0 secs / 9.801 secs)
HeadlessChrome 0.0.0 (Linux 0.0.0): Executed 587 of 763 (4 FAILED) (0 secs / 9.803 secs)
HeadlessChrome 0.0.0 (Linux 0.0.0): Executed 588 of 763 (4 FAILED) (0 secs / 9.805 secs)
HeadlessChrome 0.0.0 (Linux 0.0.0): Executed 589 of 763 (4 FAILED) (0 secs / 9.809 secs)
HeadlessChrome 0.0.0 (Linux 0.0.0): Executed 590 of 763 (4 FAILED) (0 secs / 9.813 secs)
HeadlessChrome 0.0.0 (Linux 0.0.0): Executed 591 of 763 (4 FAILED) (0 secs / 9.814 secs)
HeadlessChrome 0.0.0 (Linux 0.0.0): Executed 592 of 763 (4 FAILED) (0 secs / 9.816 secs)
HeadlessChrome 0.0.0 (Linux 0.0.0): Executed 593 of 763 (4 FAILED) (0 secs / 9.818 secs)
HeadlessChrome 0.0.0 (Linux 0.0.0): Executed 594 of 763 (4 FAILED) (0 secs / 9.819 secs)
HeadlessChrome 0.0.0 (Linux 0.0.0): Executed 595 of 763 (4 FAILED) (0 secs / 9.821 secs)
HeadlessChrome 0.0.0 (Linux 0.0.0): Executed 596 of 763 (4 FAILED) (0 secs / 9.823 secs)
HeadlessChrome 0.0.0 (Linux 0.0.0): Executed 597 of 763 (4 FAILED) (0 secs / 9.824 secs)
HeadlessChrome 0.0.0 (Linux 0.0.0): Executed 598 of 763 (4 FAILED) (0 secs / 9.825 secs)
HeadlessChrome 0.0.0 (Linux 0.0.0): Executed 599 of 763 (4 FAILED) (0 secs / 9.826 secs)
HeadlessChrome 0.0.0 (Linux 0.0.0): Executed 600 of 763 (4 FAILED) (0 secs / 9.827 secs)
HeadlessChrome 0.0.0 (Linux 0.0.0): Executed 601 of 763 (4 FAILED) (0 secs / 9.829 secs)
HeadlessChrome 0.0.0 (Linux 0.0.0): Executed 602 of 763 (4 FAILED) (0 secs / 9.833 secs)
HeadlessChrome 0.0.0 (Linux 0.0.0): Executed 603 of 763 (4 FAILED) (0 secs / 9.835 secs)
HeadlessChrome 0.0.0 (Linux 0.0.0): Executed 604 of 763 (4 FAILED) (0 secs / 9.837 secs)
HeadlessChrome 0.0.0 (Linux 0.0.0): Executed 605 of 763 (4 FAILED) (0 secs / 9.838 secs)
HeadlessChrome 0.0.0 (Linux 0.0.0): Executed 606 of 763 (4 FAILED) (0 secs / 9.839 secs)
HeadlessChrome 0.0.0 (Linux 0.0.0): Executed 607 of 763 (4 FAILED) (0 secs / 9.841 secs)
HeadlessChrome 0.0.0 (Linux 0.0.0): Executed 608 of 763 (4 FAILED) (0 secs / 9.842 secs)
HeadlessChrome 0.0.0 (Linux 0.0.0): Executed 609 of 763 (4 FAILED) (0 secs / 9.844 secs)
HeadlessChrome 0.0.0 (Linux 0.0.0): Executed 610 of 763 (4 FAILED) (0 secs / 9.847 secs)
HeadlessChrome 0.0.0 (Linux 0.0.0): Executed 611 of 763 (4 FAILED) (0 secs / 9.849 secs)
HeadlessChrome 0.0.0 (Linux 0.0.0): Executed 612 of 763 (4 FAILED) (0 secs / 9.851 secs)
HeadlessChrome 0.0.0 (Linux 0.0.0): Executed 613 of 763 (4 FAILED) (0 secs / 9.853 secs)
HeadlessChrome 0.0.0 (Linux 0.0.0): Executed 614 of 763 (4 FAILED) (0 secs / 9.854 secs)
HeadlessChrome 0.0.0 (Linux 0.0.0): Executed 615 of 763 (4 FAILED) (0 secs / 9.857 secs)
HeadlessChrome 0.0.0 (Linux 0.0.0): Executed 616 of 763 (4 FAILED) (0 secs / 9.858 secs)
HeadlessChrome 0.0.0 (Linux 0.0.0): Executed 617 of 763 (4 FAILED) (0 secs / 9.865 secs)
HeadlessChrome 0.0.0 (Linux 0.0.0): Executed 618 of 763 (4 FAILED) (0 secs / 9.866 secs)
HeadlessChrome 0.0.0 (Linux 0.0.0): Executed 619 of 763 (4 FAILED) (0 secs / 9.868 secs)
HeadlessChrome 0.0.0 (Linux 0.0.0): Executed 620 of 763 (4 FAILED) (0 secs / 9.87 secs)
HeadlessChrome 0.0.0 (Linux 0.0.0): Executed 621 of 763 (4 FAILED) (0 secs / 9.871 secs)
HeadlessChrome 0.0.0 (Linux 0.0.0): Executed 622 of 763 (4 FAILED) (0 secs / 9.873 secs)
HeadlessChrome 0.0.0 (Linux 0.0.0): Executed 623 of 763 (4 FAILED) (0 secs / 9.877 secs)
HeadlessChrome 0.0.0 (Linux 0.0.0): Executed 624 of 763 (4 FAILED) (0 secs / 9.878 secs)
HeadlessChrome 0.0.0 (Linux 0.0.0): Executed 625 of 763 (4 FAILED) (0 secs / 9.879 secs)
HeadlessChrome 0.0.0 (Linux 0.0.0): Executed 626 of 763 (4 FAILED) (0 secs / 9.881 secs)
HeadlessChrome 0.0.0 (Linux 0.0.0): Executed 627 of 763 (4 FAILED) (0 secs / 9.883 secs)
HeadlessChrome 0.0.0 (Linux 0.0.0): Executed 628 of 763 (4 FAILED) (0 secs / 9.886 secs)
HeadlessChrome 0.0.0 (Linux 0.0.0): Executed 629 of 763 (4 FAILED) (0 secs / 9.888 secs)
HeadlessChrome 0.0.0 (Linux 0.0.0): Executed 630 of 763 (4 FAILED) (0 secs / 9.89 secs)
HeadlessChrome 0.0.0 (Linux 0.0.0): Executed 631 of 763 (4 FAILED) (0 secs / 9.891 secs)
HeadlessChrome 0.0.0 (Linux 0.0.0): Executed 632 of 763 (4 FAILED) (0 secs / 9.893 secs)
HeadlessChrome 0.0.0 (Linux 0.0.0): Executed 633 of 763 (4 FAILED) (0 secs / 9.894 secs)
HeadlessChrome 0.0.0 (Linux 0.0.0): Executed 634 of 763 (4 FAILED) (0 secs / 9.897 secs)
HeadlessChrome 0.0.0 (Linux 0.0.0): Executed 635 of 763 (4 FAILED) (0 secs / 9.9 secs)
HeadlessChrome 0.0.0 (Linux 0.0.0): Executed 636 of 763 (4 FAILED) (0 secs / 9.902 secs)
HeadlessChrome 0.0.0 (Linux 0.0.0): Executed 637 of 763 (4 FAILED) (0 secs / 9.91 secs)
HeadlessChrome 0.0.0 (Linux 0.0.0): Executed 638 of 763 (4 FAILED) (0 secs / 9.912 secs)
HeadlessChrome 0.0.0 (Linux 0.0.0): Executed 639 of 763 (4 FAILED) (0 secs / 9.914 secs)
HeadlessChrome 0.0.0 (Linux 0.0.0): Executed 640 of 763 (4 FAILED) (0 secs / 9.916 secs)
HeadlessChrome 0.0.0 (Linux 0.0.0): Executed 641 of 763 (4 FAILED) (0 secs / 9.922 secs)
HeadlessChrome 0.0.0 (Linux 0.0.0): Executed 642 of 763 (4 FAILED) (0 secs / 9.924 secs)
HeadlessChrome 0.0.0 (Linux 0.0.0): Executed 643 of 763 (4 FAILED) (0 secs / 9.925 secs)
HeadlessChrome 0.0.0 (Linux 0.0.0): Executed 644 of 763 (4 FAILED) (0 secs / 9.927 secs)
HeadlessChrome 0.0.0 (Linux 0.0.0): Executed 645 of 763 (4 FAILED) (0 secs / 9.93 secs)
HeadlessChrome 0.0.0 (Linux 0.0.0): Executed 646 of 763 (4 FAILED) (0 secs / 9.931 secs)
HeadlessChrome 0.0.0 (Linux 0.0.0): Executed 647 of 763 (4 FAILED) (0 secs / 9.933 secs)
HeadlessChrome 0.0.0 (Linux 0.0.0): Executed 648 of 763 (4 FAILED) (0 secs / 9.935 secs)
HeadlessChrome 0.0.0 (Linux 0.0.0): Executed 649 of 763 (4 FAILED) (0 secs / 9.938 secs)
HeadlessChrome 0.0.0 (Linux 0.0.0): Executed 650 of 763 (4 FAILED) (0 secs / 9.94 secs)
HeadlessChrome 0.0.0 (Linux 0.0.0): Executed 651 of 763 (4 FAILED) (0 secs / 9.942 secs)
HeadlessChrome 0.0.0 (Linux 0.0.0): Executed 652 of 763 (4 FAILED) (0 secs / 9.943 secs)
HeadlessChrome 0.0.0 (Linux 0.0.0): Executed 653 of 763 (4 FAILED) (0 secs / 9.945 secs)
HeadlessChrome 0.0.0 (Linux 0.0.0): Executed 654 of 763 (4 FAILED) (0 secs / 9.948 secs)
HeadlessChrome 0.0.0 (Linux 0.0.0): Executed 655 of 763 (4 FAILED) (0 secs / 9.949 secs)
HeadlessChrome 0.0.0 (Linux 0.0.0): Executed 656 of 763 (4 FAILED) (0 secs / 9.951 secs)
HeadlessChrome 0.0.0 (Linux 0.0.0): Executed 657 of 763 (4 FAILED) (0 secs / 9.952 secs)
HeadlessChrome 0.0.0 (Linux 0.0.0): Executed 658 of 763 (4 FAILED) (0 secs / 9.954 secs)
HeadlessChrome 0.0.0 (Linux 0.0.0): Executed 659 of 763 (4 FAILED) (0 secs / 9.956 secs)
HeadlessChrome 0.0.0 (Linux 0.0.0): Executed 660 of 763 (4 FAILED) (0 secs / 9.957 secs)
HeadlessChrome 0.0.0 (Linux 0.0.0): Executed 661 of 763 (4 FAILED) (0 secs / 9.96 secs)
HeadlessChrome 0.0.0 (Linux 0.0.0): Executed 662 of 763 (4 FAILED) (0 secs / 9.962 secs)
HeadlessChrome 0.0.0 (Linux 0.0.0): Executed 663 of 763 (4 FAILED) (0 secs / 9.964 secs)
HeadlessChrome 0.0.0 (Linux 0.0.0): Executed 664 of 763 (4 FAILED) (0 secs / 9.965 secs)
HeadlessChrome 0.0.0 (Linux 0.0.0): Executed 665 of 763 (4 FAILED) (0 secs / 9.966 secs)
HeadlessChrome 0.0.0 (Linux 0.0.0): Executed 666 of 763 (4 FAILED) (0 secs / 9.967 secs)
HeadlessChrome 0.0.0 (Linux 0.0.0): Executed 667 of 763 (4 FAILED) (0 secs / 9.968 secs)
HeadlessChrome 0.0.0 (Linux 0.0.0): Executed 668 of 763 (4 FAILED) (0 secs / 9.972 secs)
HeadlessChrome 0.0.0 (Linux 0.0.0): Executed 669 of 763 (4 FAILED) (0 secs / 9.974 secs)
HeadlessChrome 0.0.0 (Linux 0.0.0): Executed 670 of 763 (4 FAILED) (0 secs / 9.976 secs)
HeadlessChrome 0.0.0 (Linux 0.0.0): Executed 671 of 763 (4 FAILED) (0 secs / 9.978 secs)
HeadlessChrome 0.0.0 (Linux 0.0.0): Executed 672 of 763 (4 FAILED) (0 secs / 9.979 secs)
HeadlessChrome 0.0.0 (Linux 0.0.0): Executed 673 of 763 (4 FAILED) (0 secs / 9.98 secs)
HeadlessChrome 0.0.0 (Linux 0.0.0): Executed 674 of 763 (4 FAILED) (0 secs / 9.982 secs)
HeadlessChrome 0.0.0 (Linux 0.0.0): Executed 675 of 763 (4 FAILED) (0 secs / 9.985 secs)
HeadlessChrome 0.0.0 (Linux 0.0.0): Executed 676 of 763 (4 FAILED) (0 secs / 9.988 secs)
HeadlessChrome 0.0.0 (Linux 0.0.0): Executed 677 of 763 (4 FAILED) (0 secs / 9.992 secs)
HeadlessChrome 0.0.0 (Linux 0.0.0): Executed 678 of 763 (4 FAILED) (0 secs / 9.994 secs)
HeadlessChrome 0.0.0 (Linux 0.0.0): Executed 679 of 763 (4 FAILED) (0 secs / 9.998 secs)
HeadlessChrome 0.0.0 (Linux 0.0.0): Executed 680 of 763 (4 FAILED) (0 secs / 10.02 secs)
HeadlessChrome 0.0.0 (Linux 0.0.0): Executed 681 of 763 (4 FAILED) (0 secs / 10.023 secs)
HeadlessChrome 0.0.0 (Linux 0.0.0): Executed 682 of 763 (4 FAILED) (0 secs / 10.026 secs)
HeadlessChrome 0.0.0 (Linux 0.0.0): Executed 683 of 763 (4 FAILED) (0 secs / 10.048 secs)
HeadlessChrome 0.0.0 (Linux 0.0.0): Executed 684 of 763 (4 FAILED) (0 secs / 10.051 secs)
HeadlessChrome 0.0.0 (Linux 0.0.0): Executed 685 of 763 (4 FAILED) (0 secs / 10.053 secs)
HeadlessChrome 0.0.0 (Linux 0.0.0): Executed 686 of 763 (4 FAILED) (0 secs / 10.056 secs)
HeadlessChrome 0.0.0 (Linux 0.0.0): Executed 687 of 763 (4 FAILED) (0 secs / 10.077 secs)
HeadlessChrome 0.0.0 (Linux 0.0.0): Executed 688 of 763 (4 FAILED) (0 secs / 10.08 secs)
HeadlessChrome 0.0.0 (Linux 0.0.0): Executed 689 of 763 (4 FAILED) (0 secs / 10.084 secs)
HeadlessChrome 0.0.0 (Linux 0.0.0): Executed 690 of 763 (4 FAILED) (0 secs / 10.106 secs)
HeadlessChrome 0.0.0 (Linux 0.0.0): Executed 691 of 763 (4 FAILED) (0 secs / 10.111 secs)
HeadlessChrome 0.0.0 (Linux 0.0.0): Executed 692 of 763 (4 FAILED) (0 secs / 10.112 secs)
HeadlessChrome 0.0.0 (Linux 0.0.0): Executed 693 of 763 (4 FAILED) (0 secs / 10.113 secs)
HeadlessChrome 0.0.0 (Linux 0.0.0): Executed 694 of 763 (4 FAILED) (0 secs / 10.116 secs)
HeadlessChrome 0.0.0 (Linux 0.0.0): Executed 695 of 763 (4 FAILED) (0 secs / 10.117 secs)
HeadlessChrome 0.0.0 (Linux 0.0.0): Executed 696 of 763 (4 FAILED) (0 secs / 10.119 secs)
HeadlessChrome 0.0.0 (Linux 0.0.0): Executed 697 of 763 (4 FAILED) (0 secs / 10.123 secs)
HeadlessChrome 0.0.0 (Linux 0.0.0): Executed 698 of 763 (4 FAILED) (0 secs / 10.126 secs)
HeadlessChrome 0.0.0 (Linux 0.0.0): Executed 699 of 763 (4 FAILED) (0 secs / 10.127 secs)
HeadlessChrome 0.0.0 (Linux 0.0.0): Executed 700 of 763 (4 FAILED) (0 secs / 10.129 secs)
HeadlessChrome 0.0.0 (Linux 0.0.0): Executed 701 of 763 (4 FAILED) (0 secs / 10.131 secs)
HeadlessChrome 0.0.0 (Linux 0.0.0): Executed 702 of 763 (4 FAILED) (0 secs / 10.132 secs)
HeadlessChrome 0.0.0 (Linux 0.0.0): Executed 703 of 763 (4 FAILED) (0 secs / 10.134 secs)
HeadlessChrome 0.0.0 (Linux 0.0.0): Executed 704 of 763 (4 FAILED) (0 secs / 10.138 secs)
HeadlessChrome 0.0.0 (Linux 0.0.0): Executed 705 of 763 (4 FAILED) (0 secs / 10.141 secs)
HeadlessChrome 0.0.0 (Linux 0.0.0): Executed 706 of 763 (4 FAILED) (0 secs / 10.142 secs)
HeadlessChrome 0.0.0 (Linux 0.0.0): Executed 707 of 763 (4 FAILED) (0 secs / 10.144 secs)
HeadlessChrome 0.0.0 (Linux 0.0.0): Executed 708 of 763 (4 FAILED) (0 secs / 10.145 secs)
HeadlessChrome 0.0.0 (Linux 0.0.0): Executed 709 of 763 (4 FAILED) (0 secs / 10.146 secs)
HeadlessChrome 0.0.0 (Linux 0.0.0): Executed 710 of 763 (4 FAILED) (0 secs / 10.148 secs)
HeadlessChrome 0.0.0 (Linux 0.0.0): Executed 711 of 763 (4 FAILED) (0 secs / 10.151 secs)
HeadlessChrome 0.0.0 (Linux 0.0.0): Executed 712 of 763 (4 FAILED) (0 secs / 10.153 secs)
HeadlessChrome 0.0.0 (Linux 0.0.0): Executed 713 of 763 (4 FAILED) (0 secs / 10.155 secs)
HeadlessChrome 0.0.0 (Linux 0.0.0): Executed 714 of 763 (4 FAILED) (0 secs / 10.178 secs)
HeadlessChrome 0.0.0 (Linux 0.0.0): Executed 715 of 763 (4 FAILED) (0 secs / 10.18 secs)
HeadlessChrome 0.0.0 (Linux 0.0.0): Executed 716 of 763 (4 FAILED) (0 secs / 10.202 secs)
HeadlessChrome 0.0.0 (Linux 0.0.0): Executed 717 of 763 (4 FAILED) (0 secs / 10.205 secs)
HeadlessChrome 0.0.0 (Linux 0.0.0): Executed 718 of 763 (4 FAILED) (0 secs / 10.206 secs)
HeadlessChrome 0.0.0 (Linux 0.0.0): Executed 719 of 763 (4 FAILED) (0 secs / 10.208 secs)
HeadlessChrome 0.0.0 (Linux 0.0.0): Executed 720 of 763 (4 FAILED) (0 secs / 10.21 secs)
HeadlessChrome 0.0.0 (Linux 0.0.0): Executed 721 of 763 (4 FAILED) (0 secs / 10.211 secs)
HeadlessChrome 0.0.0 (Linux 0.0.0): Executed 722 of 763 (4 FAILED) (0 secs / 10.214 secs)
HeadlessChrome 0.0.0 (Linux 0.0.0): Executed 723 of 763 (4 FAILED) (0 secs / 10.216 secs)
HeadlessChrome 0.0.0 (Linux 0.0.0): Executed 724 of 763 (4 FAILED) (0 secs / 10.217 secs)
HeadlessChrome 0.0.0 (Linux 0.0.0): Executed 725 of 763 (4 FAILED) (0 secs / 10.218 secs)
HeadlessChrome 0.0.0 (Linux 0.0.0): Executed 726 of 763 (4 FAILED) (0 secs / 10.22 secs)
HeadlessChrome 0.0.0 (Linux 0.0.0): Executed 727 of 763 (4 FAILED) (0 secs / 10.221 secs)
HeadlessChrome 0.0.0 (Linux 0.0.0): Executed 728 of 763 (4 FAILED) (0 secs / 10.222 secs)
HeadlessChrome 0.0.0 (Linux 0.0.0): Executed 729 of 763 (4 FAILED) (0 secs / 10.223 secs)
HeadlessChrome 0.0.0 (Linux 0.0.0): Executed 730 of 763 (4 FAILED) (0 secs / 10.227 secs)
HeadlessChrome 0.0.0 (Linux 0.0.0): Executed 731 of 763 (4 FAILED) (0 secs / 10.228 secs)
HeadlessChrome 0.0.0 (Linux 0.0.0): Executed 732 of 763 (4 FAILED) (0 secs / 10.23 secs)
HeadlessChrome 0.0.0 (Linux 0.0.0): Executed 733 of 763 (4 FAILED) (0 secs / 10.233 secs)
HeadlessChrome 0.0.0 (Linux 0.0.0): Executed 734 of 763 (4 FAILED) (0 secs / 10.235 secs)
HeadlessChrome 0.0.0 (Linux 0.0.0): Executed 735 of 763 (4 FAILED) (0 secs / 10.236 secs)
HeadlessChrome 0.0.0 (Linux 0.0.0): Executed 736 of 763 (4 FAILED) (0 secs / 10.237 secs)
HeadlessChrome 0.0.0 (Linux 0.0.0): Executed 737 of 763 (4 FAILED) (0 secs / 10.238 secs)
HeadlessChrome 0.0.0 (Linux 0.0.0): Executed 738 of 763 (4 FAILED) (0 secs / 10.24 secs)
HeadlessChrome 0.0.0 (Linux 0.0.0): Executed 739 of 763 (4 FAILED) (0 secs / 10.242 secs)
HeadlessChrome 0.0.0 (Linux 0.0.0): Executed 740 of 763 (4 FAILED) (0 secs / 10.244 secs)
HeadlessChrome 0.0.0 (Linux 0.0.0): Executed 741 of 763 (4 FAILED) (0 secs / 10.247 secs)
HeadlessChrome 0.0.0 (Linux 0.0.0): Executed 742 of 763 (4 FAILED) (0 secs / 10.248 secs)
HeadlessChrome 0.0.0 (Linux 0.0.0): Executed 743 of 763 (4 FAILED) (0 secs / 10.253 secs)
HeadlessChrome 0.0.0 (Linux 0.0.0): Executed 744 of 763 (4 FAILED) (0 secs / 10.254 secs)
HeadlessChrome 0.0.0 (Linux 0.0.0): Executed 745 of 763 (4 FAILED) (0 secs / 10.256 secs)
HeadlessChrome 0.0.0 (Linux 0.0.0): Executed 746 of 763 (4 FAILED) (0 secs / 10.258 secs)
HeadlessChrome 0.0.0 (Linux 0.0.0): Executed 747 of 763 (4 FAILED) (0 secs / 10.259 secs)
HeadlessChrome 0.0.0 (Linux 0.0.0): Executed 748 of 763 (4 FAILED) (0 secs / 10.261 secs)
HeadlessChrome 0.0.0 (Linux 0.0.0): Executed 749 of 763 (4 FAILED) (0 secs / 10.264 secs)
HeadlessChrome 0.0.0 (Linux 0.0.0): Executed 750 of 763 (4 FAILED) (0 secs / 10.265 secs)
HeadlessChrome 0.0.0 (Linux 0.0.0): Executed 751 of 763 (4 FAILED) (0 secs / 10.266 secs)
HeadlessChrome 0.0.0 (Linux 0.0.0): Executed 752 of 763 (4 FAILED) (0 secs / 10.271 secs)
HeadlessChrome 0.0.0 (Linux 0.0.0): Executed 753 of 763 (4 FAILED) (0 secs / 10.28 secs)
HeadlessChrome 0.0.0 (Linux 0.0.0): Executed 754 of 763 (4 FAILED) (0 secs / 10.282 secs)
HeadlessChrome 0.0.0 (Linux 0.0.0): Executed 755 of 763 (4 FAILED) (0 secs / 10.285 secs)
HeadlessChrome 0.0.0 (Linux 0.0.0): Executed 756 of 763 (4 FAILED) (0 secs / 10.286 secs)
HeadlessChrome 0.0.0 (Linux 0.0.0): Executed 757 of 763 (4 FAILED) (0 secs / 10.287 secs)
HeadlessChrome 0.0.0 (Linux 0.0.0): Executed 758 of 763 (4 FAILED) (0 secs / 10.288 secs)
HeadlessChrome 0.0.0 (Linux 0.0.0): Executed 759 of 763 (4 FAILED) (0 secs / 10.291 secs)
HeadlessChrome 0.0.0 (Linux 0.0.0): Executed 760 of 763 (4 FAILED) (0 secs / 10.292 secs)
HeadlessChrome 0.0.0 (Linux 0.0.0): Executed 761 of 763 (4 FAILED) (0 secs / 10.295 secs)
HeadlessChrome 0.0.0 (Linux 0.0.0): Executed 762 of 763 (4 FAILED) (0 secs / 10.297 secs)
HeadlessChrome 0.0.0 (Linux 0.0.0): Executed 763 of 763 (4 FAILED) (0 secs / 10.299 secs)
HeadlessChrome 0.0.0 (Linux 0.0.0): Executed 763 of 763 (4 FAILED) (10.678 secs / 10.299 secs)
ERROR: Error detected when running the Jasmine tests.
ERROR: Error detected when running the Jasmine tests.
Build step 'Execute shell' marked build as failure

Reply | Threaded
Open this post in threaded view
|

Jenkins build is back to normal : pgadmin4-master-python34 #852

pgAdmin 4 Jenkins