Build failed in Jenkins: pgadmin4-master-python35 #848

classic Classic list List threaded Threaded
3 messages Options
Reply | Threaded
Open this post in threaded view
|

Build failed in Jenkins: pgadmin4-master-python35 #848

pgAdmin 4 Jenkins
See <https://jenkins.pgadmin.org/job/pgadmin4-master-python35/848/display/redirect?page=changes>

Changes:

[Dave Page] Fix help for the backup/restore dialogues. Fixes #3861

[Dave Page] Don't show system catalogs in the schemas property list unless show

------------------------------------------
[...truncated 1012.97 KB...]
HeadlessChrome 0.0.0 (Linux 0.0.0): Executed 519 of 763 (4 FAILED) (0 secs / 8.667 secs)
HeadlessChrome 0.0.0 (Linux 0.0.0): Executed 520 of 763 (4 FAILED) (0 secs / 8.671 secs)
HeadlessChrome 0.0.0 (Linux 0.0.0): Executed 521 of 763 (4 FAILED) (0 secs / 8.677 secs)
HeadlessChrome 0.0.0 (Linux 0.0.0): Executed 522 of 763 (4 FAILED) (0 secs / 8.683 secs)
HeadlessChrome 0.0.0 (Linux 0.0.0): Executed 523 of 763 (4 FAILED) (0 secs / 8.687 secs)
HeadlessChrome 0.0.0 (Linux 0.0.0): Executed 524 of 763 (4 FAILED) (0 secs / 8.693 secs)
HeadlessChrome 0.0.0 (Linux 0.0.0): Executed 525 of 763 (4 FAILED) (0 secs / 8.697 secs)
HeadlessChrome 0.0.0 (Linux 0.0.0): Executed 526 of 763 (4 FAILED) (0 secs / 8.701 secs)
HeadlessChrome 0.0.0 (Linux 0.0.0): Executed 527 of 763 (4 FAILED) (0 secs / 8.704 secs)
HeadlessChrome 0.0.0 (Linux 0.0.0): Executed 528 of 763 (4 FAILED) (0 secs / 8.71 secs)
HeadlessChrome 0.0.0 (Linux 0.0.0): Executed 529 of 763 (4 FAILED) (0 secs / 8.713 secs)
HeadlessChrome 0.0.0 (Linux 0.0.0): Executed 530 of 763 (4 FAILED) (0 secs / 8.715 secs)
HeadlessChrome 0.0.0 (Linux 0.0.0): Executed 531 of 763 (4 FAILED) (0 secs / 8.717 secs)
HeadlessChrome 0.0.0 (Linux 0.0.0): Executed 532 of 763 (4 FAILED) (0 secs / 8.718 secs)
HeadlessChrome 0.0.0 (Linux 0.0.0): Executed 533 of 763 (4 FAILED) (0 secs / 8.721 secs)
HeadlessChrome 0.0.0 (Linux 0.0.0): Executed 534 of 763 (4 FAILED) (0 secs / 8.727 secs)
HeadlessChrome 0.0.0 (Linux 0.0.0): Executed 535 of 763 (4 FAILED) (0 secs / 8.734 secs)
HeadlessChrome 0.0.0 (Linux 0.0.0): Executed 536 of 763 (4 FAILED) (0 secs / 8.737 secs)
HeadlessChrome 0.0.0 (Linux 0.0.0): Executed 537 of 763 (4 FAILED) (0 secs / 8.741 secs)
HeadlessChrome 0.0.0 (Linux 0.0.0): Executed 538 of 763 (4 FAILED) (0 secs / 8.746 secs)
HeadlessChrome 0.0.0 (Linux 0.0.0): Executed 539 of 763 (4 FAILED) (0 secs / 8.748 secs)
HeadlessChrome 0.0.0 (Linux 0.0.0): Executed 540 of 763 (4 FAILED) (0 secs / 8.751 secs)
HeadlessChrome 0.0.0 (Linux 0.0.0): Executed 541 of 763 (4 FAILED) (0 secs / 8.756 secs)
HeadlessChrome 0.0.0 (Linux 0.0.0): Executed 542 of 763 (4 FAILED) (0 secs / 8.766 secs)
HeadlessChrome 0.0.0 (Linux 0.0.0): Executed 543 of 763 (4 FAILED) (0 secs / 8.773 secs)
HeadlessChrome 0.0.0 (Linux 0.0.0): Executed 544 of 763 (4 FAILED) (0 secs / 8.776 secs)
HeadlessChrome 0.0.0 (Linux 0.0.0): Executed 545 of 763 (4 FAILED) (0 secs / 8.779 secs)
HeadlessChrome 0.0.0 (Linux 0.0.0): Executed 546 of 763 (4 FAILED) (0 secs / 8.783 secs)
HeadlessChrome 0.0.0 (Linux 0.0.0): Executed 547 of 763 (4 FAILED) (0 secs / 8.786 secs)
HeadlessChrome 0.0.0 (Linux 0.0.0): Executed 548 of 763 (4 FAILED) (0 secs / 8.791 secs)
HeadlessChrome 0.0.0 (Linux 0.0.0): Executed 549 of 763 (4 FAILED) (0 secs / 8.795 secs)
HeadlessChrome 0.0.0 (Linux 0.0.0): Executed 550 of 763 (4 FAILED) (0 secs / 8.801 secs)
HeadlessChrome 0.0.0 (Linux 0.0.0): Executed 551 of 763 (4 FAILED) (0 secs / 8.806 secs)
HeadlessChrome 0.0.0 (Linux 0.0.0): Executed 552 of 763 (4 FAILED) (0 secs / 8.81 secs)
HeadlessChrome 0.0.0 (Linux 0.0.0): Executed 553 of 763 (4 FAILED) (0 secs / 8.813 secs)
HeadlessChrome 0.0.0 (Linux 0.0.0): Executed 554 of 763 (4 FAILED) (0 secs / 8.815 secs)
HeadlessChrome 0.0.0 (Linux 0.0.0): Executed 555 of 763 (4 FAILED) (0 secs / 8.819 secs)
HeadlessChrome 0.0.0 (Linux 0.0.0): Executed 556 of 763 (4 FAILED) (0 secs / 8.822 secs)
HeadlessChrome 0.0.0 (Linux 0.0.0): Executed 557 of 763 (4 FAILED) (0 secs / 8.824 secs)
HeadlessChrome 0.0.0 (Linux 0.0.0): Executed 558 of 763 (4 FAILED) (0 secs / 8.827 secs)
HeadlessChrome 0.0.0 (Linux 0.0.0): Executed 559 of 763 (4 FAILED) (0 secs / 8.831 secs)
HeadlessChrome 0.0.0 (Linux 0.0.0): Executed 560 of 763 (4 FAILED) (0 secs / 8.836 secs)
HeadlessChrome 0.0.0 (Linux 0.0.0): Executed 561 of 763 (4 FAILED) (0 secs / 8.839 secs)
HeadlessChrome 0.0.0 (Linux 0.0.0): Executed 562 of 763 (4 FAILED) (0 secs / 8.841 secs)
HeadlessChrome 0.0.0 (Linux 0.0.0): Executed 563 of 763 (4 FAILED) (0 secs / 8.842 secs)
HeadlessChrome 0.0.0 (Linux 0.0.0): Executed 564 of 763 (4 FAILED) (0 secs / 8.845 secs)
HeadlessChrome 0.0.0 (Linux 0.0.0): Executed 565 of 763 (4 FAILED) (0 secs / 8.852 secs)
HeadlessChrome 0.0.0 (Linux 0.0.0): Executed 566 of 763 (4 FAILED) (0 secs / 8.855 secs)
HeadlessChrome 0.0.0 (Linux 0.0.0): Executed 567 of 763 (4 FAILED) (0 secs / 8.862 secs)
HeadlessChrome 0.0.0 (Linux 0.0.0): Executed 568 of 763 (4 FAILED) (0 secs / 8.864 secs)
HeadlessChrome 0.0.0 (Linux 0.0.0): Executed 569 of 763 (4 FAILED) (0 secs / 8.868 secs)
HeadlessChrome 0.0.0 (Linux 0.0.0): Executed 570 of 763 (4 FAILED) (0 secs / 8.87 secs)
HeadlessChrome 0.0.0 (Linux 0.0.0): Executed 571 of 763 (4 FAILED) (0 secs / 8.872 secs)
HeadlessChrome 0.0.0 (Linux 0.0.0): Executed 572 of 763 (4 FAILED) (0 secs / 8.876 secs)
HeadlessChrome 0.0.0 (Linux 0.0.0): Executed 573 of 763 (4 FAILED) (0 secs / 8.879 secs)
HeadlessChrome 0.0.0 (Linux 0.0.0): Executed 574 of 763 (4 FAILED) (0 secs / 8.884 secs)
HeadlessChrome 0.0.0 (Linux 0.0.0): Executed 575 of 763 (4 FAILED) (0 secs / 8.887 secs)
HeadlessChrome 0.0.0 (Linux 0.0.0): Executed 576 of 763 (4 FAILED) (0 secs / 8.889 secs)
HeadlessChrome 0.0.0 (Linux 0.0.0): Executed 577 of 763 (4 FAILED) (0 secs / 8.891 secs)
HeadlessChrome 0.0.0 (Linux 0.0.0): Executed 578 of 763 (4 FAILED) (0 secs / 8.892 secs)
HeadlessChrome 0.0.0 (Linux 0.0.0): Executed 579 of 763 (4 FAILED) (0 secs / 8.895 secs)
HeadlessChrome 0.0.0 (Linux 0.0.0): Executed 580 of 763 (4 FAILED) (0 secs / 8.896 secs)
HeadlessChrome 0.0.0 (Linux 0.0.0): Executed 581 of 763 (4 FAILED) (0 secs / 8.898 secs)
HeadlessChrome 0.0.0 (Linux 0.0.0): Executed 582 of 763 (4 FAILED) (0 secs / 8.9 secs)
HeadlessChrome 0.0.0 (Linux 0.0.0): Executed 583 of 763 (4 FAILED) (0 secs / 8.901 secs)
HeadlessChrome 0.0.0 (Linux 0.0.0): Executed 584 of 763 (4 FAILED) (0 secs / 8.902 secs)
HeadlessChrome 0.0.0 (Linux 0.0.0): Executed 585 of 763 (4 FAILED) (0 secs / 8.904 secs)
HeadlessChrome 0.0.0 (Linux 0.0.0): Executed 586 of 763 (4 FAILED) (0 secs / 8.909 secs)
HeadlessChrome 0.0.0 (Linux 0.0.0): Executed 587 of 763 (4 FAILED) (0 secs / 8.911 secs)
HeadlessChrome 0.0.0 (Linux 0.0.0): Executed 588 of 763 (4 FAILED) (0 secs / 8.912 secs)
HeadlessChrome 0.0.0 (Linux 0.0.0): Executed 589 of 763 (4 FAILED) (0 secs / 8.914 secs)
HeadlessChrome 0.0.0 (Linux 0.0.0): Executed 590 of 763 (4 FAILED) (0 secs / 8.917 secs)
HeadlessChrome 0.0.0 (Linux 0.0.0): Executed 591 of 763 (4 FAILED) (0 secs / 8.918 secs)
HeadlessChrome 0.0.0 (Linux 0.0.0): Executed 592 of 763 (4 FAILED) (0 secs / 8.92 secs)
HeadlessChrome 0.0.0 (Linux 0.0.0): Executed 593 of 763 (4 FAILED) (0 secs / 8.922 secs)
HeadlessChrome 0.0.0 (Linux 0.0.0): Executed 594 of 763 (4 FAILED) (0 secs / 8.923 secs)
HeadlessChrome 0.0.0 (Linux 0.0.0): Executed 595 of 763 (4 FAILED) (0 secs / 8.924 secs)
HeadlessChrome 0.0.0 (Linux 0.0.0): Executed 596 of 763 (4 FAILED) (0 secs / 8.927 secs)
HeadlessChrome 0.0.0 (Linux 0.0.0): Executed 597 of 763 (4 FAILED) (0 secs / 8.927 secs)
HeadlessChrome 0.0.0 (Linux 0.0.0): Executed 598 of 763 (4 FAILED) (0 secs / 8.929 secs)
HeadlessChrome 0.0.0 (Linux 0.0.0): Executed 599 of 763 (4 FAILED) (0 secs / 8.931 secs)
HeadlessChrome 0.0.0 (Linux 0.0.0): Executed 600 of 763 (4 FAILED) (0 secs / 8.933 secs)
HeadlessChrome 0.0.0 (Linux 0.0.0): Executed 601 of 763 (4 FAILED) (0 secs / 8.938 secs)
HeadlessChrome 0.0.0 (Linux 0.0.0): Executed 602 of 763 (4 FAILED) (0 secs / 8.94 secs)
HeadlessChrome 0.0.0 (Linux 0.0.0): Executed 603 of 763 (4 FAILED) (0 secs / 8.942 secs)
HeadlessChrome 0.0.0 (Linux 0.0.0): Executed 604 of 763 (4 FAILED) (0 secs / 8.944 secs)
HeadlessChrome 0.0.0 (Linux 0.0.0): Executed 605 of 763 (4 FAILED) (0 secs / 8.946 secs)
HeadlessChrome 0.0.0 (Linux 0.0.0): Executed 606 of 763 (4 FAILED) (0 secs / 8.948 secs)
HeadlessChrome 0.0.0 (Linux 0.0.0): Executed 607 of 763 (4 FAILED) (0 secs / 8.95 secs)
HeadlessChrome 0.0.0 (Linux 0.0.0): Executed 608 of 763 (4 FAILED) (0 secs / 8.952 secs)
HeadlessChrome 0.0.0 (Linux 0.0.0): Executed 609 of 763 (4 FAILED) (0 secs / 8.953 secs)
HeadlessChrome 0.0.0 (Linux 0.0.0): Executed 610 of 763 (4 FAILED) (0 secs / 8.954 secs)
HeadlessChrome 0.0.0 (Linux 0.0.0): Executed 611 of 763 (4 FAILED) (0 secs / 8.956 secs)
HeadlessChrome 0.0.0 (Linux 0.0.0): Executed 612 of 763 (4 FAILED) (0 secs / 8.959 secs)
HeadlessChrome 0.0.0 (Linux 0.0.0): Executed 613 of 763 (4 FAILED) (0 secs / 8.96 secs)
HeadlessChrome 0.0.0 (Linux 0.0.0): Executed 614 of 763 (4 FAILED) (0 secs / 8.962 secs)
HeadlessChrome 0.0.0 (Linux 0.0.0): Executed 615 of 763 (4 FAILED) (0 secs / 8.964 secs)
HeadlessChrome 0.0.0 (Linux 0.0.0): Executed 616 of 763 (4 FAILED) (0 secs / 8.968 secs)
HeadlessChrome 0.0.0 (Linux 0.0.0): Executed 617 of 763 (4 FAILED) (0 secs / 8.97 secs)
HeadlessChrome 0.0.0 (Linux 0.0.0): Executed 618 of 763 (4 FAILED) (0 secs / 8.972 secs)
HeadlessChrome 0.0.0 (Linux 0.0.0): Executed 619 of 763 (4 FAILED) (0 secs / 8.974 secs)
HeadlessChrome 0.0.0 (Linux 0.0.0): Executed 620 of 763 (4 FAILED) (0 secs / 8.975 secs)
HeadlessChrome 0.0.0 (Linux 0.0.0): Executed 621 of 763 (4 FAILED) (0 secs / 8.976 secs)
HeadlessChrome 0.0.0 (Linux 0.0.0): Executed 622 of 763 (4 FAILED) (0 secs / 8.978 secs)
HeadlessChrome 0.0.0 (Linux 0.0.0): Executed 623 of 763 (4 FAILED) (0 secs / 8.98 secs)
HeadlessChrome 0.0.0 (Linux 0.0.0): Executed 624 of 763 (4 FAILED) (0 secs / 8.981 secs)
HeadlessChrome 0.0.0 (Linux 0.0.0): Executed 625 of 763 (4 FAILED) (0 secs / 8.983 secs)
HeadlessChrome 0.0.0 (Linux 0.0.0): Executed 626 of 763 (4 FAILED) (0 secs / 8.985 secs)
HeadlessChrome 0.0.0 (Linux 0.0.0): Executed 627 of 763 (4 FAILED) (0 secs / 8.988 secs)
HeadlessChrome 0.0.0 (Linux 0.0.0): Executed 628 of 763 (4 FAILED) (0 secs / 8.99 secs)
HeadlessChrome 0.0.0 (Linux 0.0.0): Executed 629 of 763 (4 FAILED) (0 secs / 8.992 secs)
HeadlessChrome 0.0.0 (Linux 0.0.0): Executed 630 of 763 (4 FAILED) (0 secs / 8.996 secs)
HeadlessChrome 0.0.0 (Linux 0.0.0): Executed 631 of 763 (4 FAILED) (0 secs / 8.997 secs)
HeadlessChrome 0.0.0 (Linux 0.0.0): Executed 632 of 763 (4 FAILED) (0 secs / 8.999 secs)
HeadlessChrome 0.0.0 (Linux 0.0.0): Executed 633 of 763 (4 FAILED) (0 secs / 9 secs)
HeadlessChrome 0.0.0 (Linux 0.0.0): Executed 634 of 763 (4 FAILED) (0 secs / 9.002 secs)
HeadlessChrome 0.0.0 (Linux 0.0.0): Executed 635 of 763 (4 FAILED) (0 secs / 9.005 secs)
HeadlessChrome 0.0.0 (Linux 0.0.0): Executed 636 of 763 (4 FAILED) (0 secs / 9.009 secs)
HeadlessChrome 0.0.0 (Linux 0.0.0): Executed 637 of 763 (4 FAILED) (0 secs / 9.013 secs)
HeadlessChrome 0.0.0 (Linux 0.0.0): Executed 638 of 763 (4 FAILED) (0 secs / 9.02 secs)
HeadlessChrome 0.0.0 (Linux 0.0.0): Executed 639 of 763 (4 FAILED) (0 secs / 9.022 secs)
HeadlessChrome 0.0.0 (Linux 0.0.0): Executed 640 of 763 (4 FAILED) (0 secs / 9.024 secs)
HeadlessChrome 0.0.0 (Linux 0.0.0): Executed 641 of 763 (4 FAILED) (0 secs / 9.027 secs)
HeadlessChrome 0.0.0 (Linux 0.0.0): Executed 642 of 763 (4 FAILED) (0 secs / 9.028 secs)
HeadlessChrome 0.0.0 (Linux 0.0.0): Executed 643 of 763 (4 FAILED) (0 secs / 9.031 secs)
HeadlessChrome 0.0.0 (Linux 0.0.0): Executed 644 of 763 (4 FAILED) (0 secs / 9.033 secs)
HeadlessChrome 0.0.0 (Linux 0.0.0): Executed 645 of 763 (4 FAILED) (0 secs / 9.036 secs)
HeadlessChrome 0.0.0 (Linux 0.0.0): Executed 646 of 763 (4 FAILED) (0 secs / 9.037 secs)
HeadlessChrome 0.0.0 (Linux 0.0.0): Executed 647 of 763 (4 FAILED) (0 secs / 9.04 secs)
HeadlessChrome 0.0.0 (Linux 0.0.0): Executed 648 of 763 (4 FAILED) (0 secs / 9.041 secs)
HeadlessChrome 0.0.0 (Linux 0.0.0): Executed 649 of 763 (4 FAILED) (0 secs / 9.043 secs)
HeadlessChrome 0.0.0 (Linux 0.0.0): Executed 650 of 763 (4 FAILED) (0 secs / 9.046 secs)
HeadlessChrome 0.0.0 (Linux 0.0.0): Executed 651 of 763 (4 FAILED) (0 secs / 9.048 secs)
HeadlessChrome 0.0.0 (Linux 0.0.0): Executed 652 of 763 (4 FAILED) (0 secs / 9.05 secs)
HeadlessChrome 0.0.0 (Linux 0.0.0): Executed 653 of 763 (4 FAILED) (0 secs / 9.052 secs)
HeadlessChrome 0.0.0 (Linux 0.0.0): Executed 654 of 763 (4 FAILED) (0 secs / 9.054 secs)
HeadlessChrome 0.0.0 (Linux 0.0.0): Executed 655 of 763 (4 FAILED) (0 secs / 9.055 secs)
HeadlessChrome 0.0.0 (Linux 0.0.0): Executed 656 of 763 (4 FAILED) (0 secs / 9.057 secs)
HeadlessChrome 0.0.0 (Linux 0.0.0): Executed 657 of 763 (4 FAILED) (0 secs / 9.059 secs)
HeadlessChrome 0.0.0 (Linux 0.0.0): Executed 658 of 763 (4 FAILED) (0 secs / 9.062 secs)
HeadlessChrome 0.0.0 (Linux 0.0.0): Executed 659 of 763 (4 FAILED) (0 secs / 9.063 secs)
HeadlessChrome 0.0.0 (Linux 0.0.0): Executed 660 of 763 (4 FAILED) (0 secs / 9.065 secs)
HeadlessChrome 0.0.0 (Linux 0.0.0): Executed 661 of 763 (4 FAILED) (0 secs / 9.067 secs)
HeadlessChrome 0.0.0 (Linux 0.0.0): Executed 662 of 763 (4 FAILED) (0 secs / 9.068 secs)
HeadlessChrome 0.0.0 (Linux 0.0.0): Executed 663 of 763 (4 FAILED) (0 secs / 9.069 secs)
HeadlessChrome 0.0.0 (Linux 0.0.0): Executed 664 of 763 (4 FAILED) (0 secs / 9.072 secs)
HeadlessChrome 0.0.0 (Linux 0.0.0): Executed 665 of 763 (4 FAILED) (0 secs / 9.073 secs)
HeadlessChrome 0.0.0 (Linux 0.0.0): Executed 666 of 763 (4 FAILED) (0 secs / 9.075 secs)
HeadlessChrome 0.0.0 (Linux 0.0.0): Executed 667 of 763 (4 FAILED) (0 secs / 9.076 secs)
HeadlessChrome 0.0.0 (Linux 0.0.0): Executed 668 of 763 (4 FAILED) (0 secs / 9.077 secs)
HeadlessChrome 0.0.0 (Linux 0.0.0): Executed 669 of 763 (4 FAILED) (0 secs / 9.079 secs)
HeadlessChrome 0.0.0 (Linux 0.0.0): Executed 670 of 763 (4 FAILED) (0 secs / 9.081 secs)
HeadlessChrome 0.0.0 (Linux 0.0.0): Executed 671 of 763 (4 FAILED) (0 secs / 9.084 secs)
HeadlessChrome 0.0.0 (Linux 0.0.0): Executed 672 of 763 (4 FAILED) (0 secs / 9.085 secs)
HeadlessChrome 0.0.0 (Linux 0.0.0): Executed 673 of 763 (4 FAILED) (0 secs / 9.087 secs)
HeadlessChrome 0.0.0 (Linux 0.0.0): Executed 674 of 763 (4 FAILED) (0 secs / 9.089 secs)
HeadlessChrome 0.0.0 (Linux 0.0.0): Executed 675 of 763 (4 FAILED) (0 secs / 9.09 secs)
HeadlessChrome 0.0.0 (Linux 0.0.0): Executed 676 of 763 (4 FAILED) (0 secs / 9.092 secs)
HeadlessChrome 0.0.0 (Linux 0.0.0): Executed 677 of 763 (4 FAILED) (0 secs / 9.097 secs)
HeadlessChrome 0.0.0 (Linux 0.0.0): Executed 678 of 763 (4 FAILED) (0 secs / 9.1 secs)
HeadlessChrome 0.0.0 (Linux 0.0.0): Executed 679 of 763 (4 FAILED) (0 secs / 9.103 secs)
HeadlessChrome 0.0.0 (Linux 0.0.0): Executed 680 of 763 (4 FAILED) (0 secs / 9.126 secs)
HeadlessChrome 0.0.0 (Linux 0.0.0): Executed 681 of 763 (4 FAILED) (0 secs / 9.129 secs)
HeadlessChrome 0.0.0 (Linux 0.0.0): Executed 682 of 763 (4 FAILED) (0 secs / 9.132 secs)
HeadlessChrome 0.0.0 (Linux 0.0.0): Executed 683 of 763 (4 FAILED) (0 secs / 9.154 secs)
HeadlessChrome 0.0.0 (Linux 0.0.0): Executed 684 of 763 (4 FAILED) (0 secs / 9.157 secs)
HeadlessChrome 0.0.0 (Linux 0.0.0): Executed 685 of 763 (4 FAILED) (0 secs / 9.16 secs)
HeadlessChrome 0.0.0 (Linux 0.0.0): Executed 686 of 763 (4 FAILED) (0 secs / 9.163 secs)
HeadlessChrome 0.0.0 (Linux 0.0.0): Executed 687 of 763 (4 FAILED) (0 secs / 9.185 secs)
HeadlessChrome 0.0.0 (Linux 0.0.0): Executed 688 of 763 (4 FAILED) (0 secs / 9.188 secs)
HeadlessChrome 0.0.0 (Linux 0.0.0): Executed 689 of 763 (4 FAILED) (0 secs / 9.192 secs)
HeadlessChrome 0.0.0 (Linux 0.0.0): Executed 690 of 763 (4 FAILED) (0 secs / 9.214 secs)
HeadlessChrome 0.0.0 (Linux 0.0.0): Executed 691 of 763 (4 FAILED) (0 secs / 9.217 secs)
HeadlessChrome 0.0.0 (Linux 0.0.0): Executed 692 of 763 (4 FAILED) (0 secs / 9.219 secs)
HeadlessChrome 0.0.0 (Linux 0.0.0): Executed 693 of 763 (4 FAILED) (0 secs / 9.221 secs)
HeadlessChrome 0.0.0 (Linux 0.0.0): Executed 694 of 763 (4 FAILED) (0 secs / 9.225 secs)
HeadlessChrome 0.0.0 (Linux 0.0.0): Executed 695 of 763 (4 FAILED) (0 secs / 9.227 secs)
HeadlessChrome 0.0.0 (Linux 0.0.0): Executed 696 of 763 (4 FAILED) (0 secs / 9.228 secs)
HeadlessChrome 0.0.0 (Linux 0.0.0): Executed 697 of 763 (4 FAILED) (0 secs / 9.229 secs)
HeadlessChrome 0.0.0 (Linux 0.0.0): Executed 698 of 763 (4 FAILED) (0 secs / 9.232 secs)
HeadlessChrome 0.0.0 (Linux 0.0.0): Executed 699 of 763 (4 FAILED) (0 secs / 9.233 secs)
HeadlessChrome 0.0.0 (Linux 0.0.0): Executed 700 of 763 (4 FAILED) (0 secs / 9.237 secs)
HeadlessChrome 0.0.0 (Linux 0.0.0): Executed 701 of 763 (4 FAILED) (0 secs / 9.238 secs)
HeadlessChrome 0.0.0 (Linux 0.0.0): Executed 702 of 763 (4 FAILED) (0 secs / 9.24 secs)
HeadlessChrome 0.0.0 (Linux 0.0.0): Executed 703 of 763 (4 FAILED) (0 secs / 9.242 secs)
HeadlessChrome 0.0.0 (Linux 0.0.0): Executed 704 of 763 (4 FAILED) (0 secs / 9.244 secs)
HeadlessChrome 0.0.0 (Linux 0.0.0): Executed 705 of 763 (4 FAILED) (0 secs / 9.247 secs)
HeadlessChrome 0.0.0 (Linux 0.0.0): Executed 706 of 763 (4 FAILED) (0 secs / 9.25 secs)
HeadlessChrome 0.0.0 (Linux 0.0.0): Executed 707 of 763 (4 FAILED) (0 secs / 9.252 secs)
HeadlessChrome 0.0.0 (Linux 0.0.0): Executed 708 of 763 (4 FAILED) (0 secs / 9.253 secs)
HeadlessChrome 0.0.0 (Linux 0.0.0): Executed 709 of 763 (4 FAILED) (0 secs / 9.255 secs)
HeadlessChrome 0.0.0 (Linux 0.0.0): Executed 710 of 763 (4 FAILED) (0 secs / 9.257 secs)
HeadlessChrome 0.0.0 (Linux 0.0.0): Executed 711 of 763 (4 FAILED) (0 secs / 9.259 secs)
HeadlessChrome 0.0.0 (Linux 0.0.0): Executed 712 of 763 (4 FAILED) (0 secs / 9.261 secs)
HeadlessChrome 0.0.0 (Linux 0.0.0): Executed 713 of 763 (4 FAILED) (0 secs / 9.264 secs)
HeadlessChrome 0.0.0 (Linux 0.0.0): Executed 714 of 763 (4 FAILED) (0 secs / 9.286 secs)
HeadlessChrome 0.0.0 (Linux 0.0.0): Executed 715 of 763 (4 FAILED) (0 secs / 9.288 secs)
HeadlessChrome 0.0.0 (Linux 0.0.0): Executed 716 of 763 (4 FAILED) (0 secs / 9.309 secs)
HeadlessChrome 0.0.0 (Linux 0.0.0): Executed 717 of 763 (4 FAILED) (0 secs / 9.312 secs)
HeadlessChrome 0.0.0 (Linux 0.0.0): Executed 718 of 763 (4 FAILED) (0 secs / 9.315 secs)
HeadlessChrome 0.0.0 (Linux 0.0.0): Executed 719 of 763 (4 FAILED) (0 secs / 9.317 secs)
HeadlessChrome 0.0.0 (Linux 0.0.0): Executed 720 of 763 (4 FAILED) (0 secs / 9.319 secs)
HeadlessChrome 0.0.0 (Linux 0.0.0): Executed 721 of 763 (4 FAILED) (0 secs / 9.32 secs)
HeadlessChrome 0.0.0 (Linux 0.0.0): Executed 722 of 763 (4 FAILED) (0 secs / 9.322 secs)
HeadlessChrome 0.0.0 (Linux 0.0.0): Executed 723 of 763 (4 FAILED) (0 secs / 9.326 secs)
HeadlessChrome 0.0.0 (Linux 0.0.0): Executed 724 of 763 (4 FAILED) (0 secs / 9.328 secs)
HeadlessChrome 0.0.0 (Linux 0.0.0): Executed 725 of 763 (4 FAILED) (0 secs / 9.329 secs)
HeadlessChrome 0.0.0 (Linux 0.0.0): Executed 726 of 763 (4 FAILED) (0 secs / 9.331 secs)
HeadlessChrome 0.0.0 (Linux 0.0.0): Executed 727 of 763 (4 FAILED) (0 secs / 9.332 secs)
HeadlessChrome 0.0.0 (Linux 0.0.0): Executed 728 of 763 (4 FAILED) (0 secs / 9.334 secs)
HeadlessChrome 0.0.0 (Linux 0.0.0): Executed 729 of 763 (4 FAILED) (0 secs / 9.336 secs)
HeadlessChrome 0.0.0 (Linux 0.0.0): Executed 730 of 763 (4 FAILED) (0 secs / 9.337 secs)
HeadlessChrome 0.0.0 (Linux 0.0.0): Executed 731 of 763 (4 FAILED) (0 secs / 9.34 secs)
HeadlessChrome 0.0.0 (Linux 0.0.0): Executed 732 of 763 (4 FAILED) (0 secs / 9.342 secs)
HeadlessChrome 0.0.0 (Linux 0.0.0): Executed 733 of 763 (4 FAILED) (0 secs / 9.345 secs)
HeadlessChrome 0.0.0 (Linux 0.0.0): Executed 734 of 763 (4 FAILED) (0 secs / 9.347 secs)
HeadlessChrome 0.0.0 (Linux 0.0.0): Executed 735 of 763 (4 FAILED) (0 secs / 9.348 secs)
HeadlessChrome 0.0.0 (Linux 0.0.0): Executed 736 of 763 (4 FAILED) (0 secs / 9.349 secs)
HeadlessChrome 0.0.0 (Linux 0.0.0): Executed 737 of 763 (4 FAILED) (0 secs / 9.35 secs)
HeadlessChrome 0.0.0 (Linux 0.0.0): Executed 738 of 763 (4 FAILED) (0 secs / 9.354 secs)
HeadlessChrome 0.0.0 (Linux 0.0.0): Executed 739 of 763 (4 FAILED) (0 secs / 9.355 secs)
HeadlessChrome 0.0.0 (Linux 0.0.0): Executed 740 of 763 (4 FAILED) (0 secs / 9.356 secs)
HeadlessChrome 0.0.0 (Linux 0.0.0): Executed 741 of 763 (4 FAILED) (0 secs / 9.358 secs)
HeadlessChrome 0.0.0 (Linux 0.0.0): Executed 742 of 763 (4 FAILED) (0 secs / 9.36 secs)
HeadlessChrome 0.0.0 (Linux 0.0.0): Executed 743 of 763 (4 FAILED) (0 secs / 9.361 secs)
HeadlessChrome 0.0.0 (Linux 0.0.0): Executed 744 of 763 (4 FAILED) (0 secs / 9.363 secs)
HeadlessChrome 0.0.0 (Linux 0.0.0): Executed 745 of 763 (4 FAILED) (0 secs / 9.365 secs)
HeadlessChrome 0.0.0 (Linux 0.0.0): Executed 746 of 763 (4 FAILED) (0 secs / 9.369 secs)
HeadlessChrome 0.0.0 (Linux 0.0.0): Executed 747 of 763 (4 FAILED) (0 secs / 9.37 secs)
HeadlessChrome 0.0.0 (Linux 0.0.0): Executed 748 of 763 (4 FAILED) (0 secs / 9.37 secs)
HeadlessChrome 0.0.0 (Linux 0.0.0): Executed 749 of 763 (4 FAILED) (0 secs / 9.373 secs)
HeadlessChrome 0.0.0 (Linux 0.0.0): Executed 750 of 763 (4 FAILED) (0 secs / 9.375 secs)
HeadlessChrome 0.0.0 (Linux 0.0.0): Executed 751 of 763 (4 FAILED) (0 secs / 9.376 secs)
HeadlessChrome 0.0.0 (Linux 0.0.0): Executed 752 of 763 (4 FAILED) (0 secs / 9.38 secs)
HeadlessChrome 0.0.0 (Linux 0.0.0): Executed 753 of 763 (4 FAILED) (0 secs / 9.383 secs)
HeadlessChrome 0.0.0 (Linux 0.0.0): Executed 754 of 763 (4 FAILED) (0 secs / 9.384 secs)
HeadlessChrome 0.0.0 (Linux 0.0.0): Executed 755 of 763 (4 FAILED) (0 secs / 9.386 secs)
HeadlessChrome 0.0.0 (Linux 0.0.0): Executed 756 of 763 (4 FAILED) (0 secs / 9.387 secs)
HeadlessChrome 0.0.0 (Linux 0.0.0): Executed 757 of 763 (4 FAILED) (0 secs / 9.389 secs)
HeadlessChrome 0.0.0 (Linux 0.0.0): Executed 758 of 763 (4 FAILED) (0 secs / 9.391 secs)
HeadlessChrome 0.0.0 (Linux 0.0.0): Executed 759 of 763 (4 FAILED) (0 secs / 9.394 secs)
HeadlessChrome 0.0.0 (Linux 0.0.0): Executed 760 of 763 (4 FAILED) (0 secs / 9.403 secs)
HeadlessChrome 0.0.0 (Linux 0.0.0): Executed 761 of 763 (4 FAILED) (0 secs / 9.404 secs)
HeadlessChrome 0.0.0 (Linux 0.0.0): Executed 762 of 763 (4 FAILED) (0 secs / 9.406 secs)
HeadlessChrome 0.0.0 (Linux 0.0.0): Executed 763 of 763 (4 FAILED) (0 secs / 9.409 secs)
HeadlessChrome 0.0.0 (Linux 0.0.0): Executed 763 of 763 (4 FAILED) (9.813 secs / 9.409 secs)
ERROR: Error detected when running the Jasmine tests.
ERROR: Error detected when running the Jasmine tests.
Build step 'Execute shell' marked build as failure

Reply | Threaded
Open this post in threaded view
|

Build failed in Jenkins: pgadmin4-master-python35 #849

pgAdmin 4 Jenkins
See <https://jenkins.pgadmin.org/job/pgadmin4-master-python35/849/display/redirect?page=changes>

Changes:

[Dave Page] Ensure the context menu works after a server is renamed. Fixes #3575

------------------------------------------
[...truncated 1012.93 KB...]
HeadlessChrome 0.0.0 (Linux 0.0.0): Executed 519 of 763 (4 FAILED) (0 secs / 7.786 secs)
HeadlessChrome 0.0.0 (Linux 0.0.0): Executed 520 of 763 (4 FAILED) (0 secs / 7.788 secs)
HeadlessChrome 0.0.0 (Linux 0.0.0): Executed 521 of 763 (4 FAILED) (0 secs / 7.793 secs)
HeadlessChrome 0.0.0 (Linux 0.0.0): Executed 522 of 763 (4 FAILED) (0 secs / 7.799 secs)
HeadlessChrome 0.0.0 (Linux 0.0.0): Executed 523 of 763 (4 FAILED) (0 secs / 7.803 secs)
HeadlessChrome 0.0.0 (Linux 0.0.0): Executed 524 of 763 (4 FAILED) (0 secs / 7.806 secs)
HeadlessChrome 0.0.0 (Linux 0.0.0): Executed 525 of 763 (4 FAILED) (0 secs / 7.809 secs)
HeadlessChrome 0.0.0 (Linux 0.0.0): Executed 526 of 763 (4 FAILED) (0 secs / 7.817 secs)
HeadlessChrome 0.0.0 (Linux 0.0.0): Executed 527 of 763 (4 FAILED) (0 secs / 7.818 secs)
HeadlessChrome 0.0.0 (Linux 0.0.0): Executed 528 of 763 (4 FAILED) (0 secs / 7.821 secs)
HeadlessChrome 0.0.0 (Linux 0.0.0): Executed 529 of 763 (4 FAILED) (0 secs / 7.823 secs)
HeadlessChrome 0.0.0 (Linux 0.0.0): Executed 530 of 763 (4 FAILED) (0 secs / 7.825 secs)
HeadlessChrome 0.0.0 (Linux 0.0.0): Executed 531 of 763 (4 FAILED) (0 secs / 7.828 secs)
HeadlessChrome 0.0.0 (Linux 0.0.0): Executed 532 of 763 (4 FAILED) (0 secs / 7.83 secs)
HeadlessChrome 0.0.0 (Linux 0.0.0): Executed 533 of 763 (4 FAILED) (0 secs / 7.832 secs)
HeadlessChrome 0.0.0 (Linux 0.0.0): Executed 534 of 763 (4 FAILED) (0 secs / 7.838 secs)
HeadlessChrome 0.0.0 (Linux 0.0.0): Executed 535 of 763 (4 FAILED) (0 secs / 7.846 secs)
HeadlessChrome 0.0.0 (Linux 0.0.0): Executed 536 of 763 (4 FAILED) (0 secs / 7.848 secs)
HeadlessChrome 0.0.0 (Linux 0.0.0): Executed 537 of 763 (4 FAILED) (0 secs / 7.852 secs)
HeadlessChrome 0.0.0 (Linux 0.0.0): Executed 538 of 763 (4 FAILED) (0 secs / 7.855 secs)
HeadlessChrome 0.0.0 (Linux 0.0.0): Executed 539 of 763 (4 FAILED) (0 secs / 7.86 secs)
HeadlessChrome 0.0.0 (Linux 0.0.0): Executed 540 of 763 (4 FAILED) (0 secs / 7.864 secs)
HeadlessChrome 0.0.0 (Linux 0.0.0): Executed 541 of 763 (4 FAILED) (0 secs / 7.868 secs)
HeadlessChrome 0.0.0 (Linux 0.0.0): Executed 542 of 763 (4 FAILED) (0 secs / 7.872 secs)
HeadlessChrome 0.0.0 (Linux 0.0.0): Executed 543 of 763 (4 FAILED) (0 secs / 7.88 secs)
HeadlessChrome 0.0.0 (Linux 0.0.0): Executed 544 of 763 (4 FAILED) (0 secs / 7.886 secs)
HeadlessChrome 0.0.0 (Linux 0.0.0): Executed 545 of 763 (4 FAILED) (0 secs / 7.889 secs)
HeadlessChrome 0.0.0 (Linux 0.0.0): Executed 546 of 763 (4 FAILED) (0 secs / 7.894 secs)
HeadlessChrome 0.0.0 (Linux 0.0.0): Executed 547 of 763 (4 FAILED) (0 secs / 7.897 secs)
HeadlessChrome 0.0.0 (Linux 0.0.0): Executed 548 of 763 (4 FAILED) (0 secs / 7.901 secs)
HeadlessChrome 0.0.0 (Linux 0.0.0): Executed 549 of 763 (4 FAILED) (0 secs / 7.905 secs)
HeadlessChrome 0.0.0 (Linux 0.0.0): Executed 550 of 763 (4 FAILED) (0 secs / 7.914 secs)
HeadlessChrome 0.0.0 (Linux 0.0.0): Executed 551 of 763 (4 FAILED) (0 secs / 7.918 secs)
HeadlessChrome 0.0.0 (Linux 0.0.0): Executed 552 of 763 (4 FAILED) (0 secs / 7.922 secs)
HeadlessChrome 0.0.0 (Linux 0.0.0): Executed 553 of 763 (4 FAILED) (0 secs / 7.926 secs)
HeadlessChrome 0.0.0 (Linux 0.0.0): Executed 554 of 763 (4 FAILED) (0 secs / 7.929 secs)
HeadlessChrome 0.0.0 (Linux 0.0.0): Executed 555 of 763 (4 FAILED) (0 secs / 7.932 secs)
HeadlessChrome 0.0.0 (Linux 0.0.0): Executed 556 of 763 (4 FAILED) (0 secs / 7.934 secs)
HeadlessChrome 0.0.0 (Linux 0.0.0): Executed 557 of 763 (4 FAILED) (0 secs / 7.936 secs)
HeadlessChrome 0.0.0 (Linux 0.0.0): Executed 558 of 763 (4 FAILED) (0 secs / 7.942 secs)
HeadlessChrome 0.0.0 (Linux 0.0.0): Executed 559 of 763 (4 FAILED) (0 secs / 7.944 secs)
HeadlessChrome 0.0.0 (Linux 0.0.0): Executed 560 of 763 (4 FAILED) (0 secs / 7.948 secs)
HeadlessChrome 0.0.0 (Linux 0.0.0): Executed 561 of 763 (4 FAILED) (0 secs / 7.951 secs)
HeadlessChrome 0.0.0 (Linux 0.0.0): Executed 562 of 763 (4 FAILED) (0 secs / 7.956 secs)
HeadlessChrome 0.0.0 (Linux 0.0.0): Executed 563 of 763 (4 FAILED) (0 secs / 7.964 secs)
HeadlessChrome 0.0.0 (Linux 0.0.0): Executed 564 of 763 (4 FAILED) (0 secs / 7.967 secs)
HeadlessChrome 0.0.0 (Linux 0.0.0): Executed 565 of 763 (4 FAILED) (0 secs / 7.97 secs)
HeadlessChrome 0.0.0 (Linux 0.0.0): Executed 566 of 763 (4 FAILED) (0 secs / 7.977 secs)
HeadlessChrome 0.0.0 (Linux 0.0.0): Executed 567 of 763 (4 FAILED) (0 secs / 7.983 secs)
HeadlessChrome 0.0.0 (Linux 0.0.0): Executed 568 of 763 (4 FAILED) (0 secs / 7.985 secs)
HeadlessChrome 0.0.0 (Linux 0.0.0): Executed 569 of 763 (4 FAILED) (0 secs / 7.988 secs)
HeadlessChrome 0.0.0 (Linux 0.0.0): Executed 570 of 763 (4 FAILED) (0 secs / 7.991 secs)
HeadlessChrome 0.0.0 (Linux 0.0.0): Executed 571 of 763 (4 FAILED) (0 secs / 7.994 secs)
HeadlessChrome 0.0.0 (Linux 0.0.0): Executed 572 of 763 (4 FAILED) (0 secs / 7.998 secs)
HeadlessChrome 0.0.0 (Linux 0.0.0): Executed 573 of 763 (4 FAILED) (0 secs / 8 secs)
HeadlessChrome 0.0.0 (Linux 0.0.0): Executed 574 of 763 (4 FAILED) (0 secs / 8.005 secs)
HeadlessChrome 0.0.0 (Linux 0.0.0): Executed 575 of 763 (4 FAILED) (0 secs / 8.008 secs)
HeadlessChrome 0.0.0 (Linux 0.0.0): Executed 576 of 763 (4 FAILED) (0 secs / 8.01 secs)
HeadlessChrome 0.0.0 (Linux 0.0.0): Executed 577 of 763 (4 FAILED) (0 secs / 8.013 secs)
HeadlessChrome 0.0.0 (Linux 0.0.0): Executed 578 of 763 (4 FAILED) (0 secs / 8.014 secs)
HeadlessChrome 0.0.0 (Linux 0.0.0): Executed 579 of 763 (4 FAILED) (0 secs / 8.015 secs)
HeadlessChrome 0.0.0 (Linux 0.0.0): Executed 580 of 763 (4 FAILED) (0 secs / 8.017 secs)
HeadlessChrome 0.0.0 (Linux 0.0.0): Executed 581 of 763 (4 FAILED) (0 secs / 8.018 secs)
HeadlessChrome 0.0.0 (Linux 0.0.0): Executed 582 of 763 (4 FAILED) (0 secs / 8.021 secs)
HeadlessChrome 0.0.0 (Linux 0.0.0): Executed 583 of 763 (4 FAILED) (0 secs / 8.022 secs)
HeadlessChrome 0.0.0 (Linux 0.0.0): Executed 584 of 763 (4 FAILED) (0 secs / 8.024 secs)
HeadlessChrome 0.0.0 (Linux 0.0.0): Executed 585 of 763 (4 FAILED) (0 secs / 8.026 secs)
HeadlessChrome 0.0.0 (Linux 0.0.0): Executed 586 of 763 (4 FAILED) (0 secs / 8.028 secs)
HeadlessChrome 0.0.0 (Linux 0.0.0): Executed 587 of 763 (4 FAILED) (0 secs / 8.031 secs)
HeadlessChrome 0.0.0 (Linux 0.0.0): Executed 588 of 763 (4 FAILED) (0 secs / 8.032 secs)
HeadlessChrome 0.0.0 (Linux 0.0.0): Executed 589 of 763 (4 FAILED) (0 secs / 8.033 secs)
HeadlessChrome 0.0.0 (Linux 0.0.0): Executed 590 of 763 (4 FAILED) (0 secs / 8.035 secs)
HeadlessChrome 0.0.0 (Linux 0.0.0): Executed 591 of 763 (4 FAILED) (0 secs / 8.036 secs)
HeadlessChrome 0.0.0 (Linux 0.0.0): Executed 592 of 763 (4 FAILED) (0 secs / 8.037 secs)
HeadlessChrome 0.0.0 (Linux 0.0.0): Executed 593 of 763 (4 FAILED) (0 secs / 8.038 secs)
HeadlessChrome 0.0.0 (Linux 0.0.0): Executed 594 of 763 (4 FAILED) (0 secs / 8.04 secs)
HeadlessChrome 0.0.0 (Linux 0.0.0): Executed 595 of 763 (4 FAILED) (0 secs / 8.042 secs)
HeadlessChrome 0.0.0 (Linux 0.0.0): Executed 596 of 763 (4 FAILED) (0 secs / 8.043 secs)
HeadlessChrome 0.0.0 (Linux 0.0.0): Executed 597 of 763 (4 FAILED) (0 secs / 8.045 secs)
HeadlessChrome 0.0.0 (Linux 0.0.0): Executed 598 of 763 (4 FAILED) (0 secs / 8.046 secs)
HeadlessChrome 0.0.0 (Linux 0.0.0): Executed 599 of 763 (4 FAILED) (0 secs / 8.047 secs)
HeadlessChrome 0.0.0 (Linux 0.0.0): Executed 600 of 763 (4 FAILED) (0 secs / 8.048 secs)
HeadlessChrome 0.0.0 (Linux 0.0.0): Executed 601 of 763 (4 FAILED) (0 secs / 8.052 secs)
HeadlessChrome 0.0.0 (Linux 0.0.0): Executed 602 of 763 (4 FAILED) (0 secs / 8.055 secs)
HeadlessChrome 0.0.0 (Linux 0.0.0): Executed 603 of 763 (4 FAILED) (0 secs / 8.056 secs)
HeadlessChrome 0.0.0 (Linux 0.0.0): Executed 604 of 763 (4 FAILED) (0 secs / 8.057 secs)
HeadlessChrome 0.0.0 (Linux 0.0.0): Executed 605 of 763 (4 FAILED) (0 secs / 8.059 secs)
HeadlessChrome 0.0.0 (Linux 0.0.0): Executed 606 of 763 (4 FAILED) (0 secs / 8.06 secs)
HeadlessChrome 0.0.0 (Linux 0.0.0): Executed 607 of 763 (4 FAILED) (0 secs / 8.061 secs)
HeadlessChrome 0.0.0 (Linux 0.0.0): Executed 608 of 763 (4 FAILED) (0 secs / 8.063 secs)
HeadlessChrome 0.0.0 (Linux 0.0.0): Executed 609 of 763 (4 FAILED) (0 secs / 8.064 secs)
HeadlessChrome 0.0.0 (Linux 0.0.0): Executed 610 of 763 (4 FAILED) (0 secs / 8.066 secs)
HeadlessChrome 0.0.0 (Linux 0.0.0): Executed 611 of 763 (4 FAILED) (0 secs / 8.068 secs)
HeadlessChrome 0.0.0 (Linux 0.0.0): Executed 612 of 763 (4 FAILED) (0 secs / 8.071 secs)
HeadlessChrome 0.0.0 (Linux 0.0.0): Executed 613 of 763 (4 FAILED) (0 secs / 8.072 secs)
HeadlessChrome 0.0.0 (Linux 0.0.0): Executed 614 of 763 (4 FAILED) (0 secs / 8.073 secs)
HeadlessChrome 0.0.0 (Linux 0.0.0): Executed 615 of 763 (4 FAILED) (0 secs / 8.075 secs)
HeadlessChrome 0.0.0 (Linux 0.0.0): Executed 616 of 763 (4 FAILED) (0 secs / 8.077 secs)
HeadlessChrome 0.0.0 (Linux 0.0.0): Executed 617 of 763 (4 FAILED) (0 secs / 8.081 secs)
HeadlessChrome 0.0.0 (Linux 0.0.0): Executed 618 of 763 (4 FAILED) (0 secs / 8.083 secs)
HeadlessChrome 0.0.0 (Linux 0.0.0): Executed 619 of 763 (4 FAILED) (0 secs / 8.085 secs)
HeadlessChrome 0.0.0 (Linux 0.0.0): Executed 620 of 763 (4 FAILED) (0 secs / 8.086 secs)
HeadlessChrome 0.0.0 (Linux 0.0.0): Executed 621 of 763 (4 FAILED) (0 secs / 8.088 secs)
HeadlessChrome 0.0.0 (Linux 0.0.0): Executed 622 of 763 (4 FAILED) (0 secs / 8.09 secs)
HeadlessChrome 0.0.0 (Linux 0.0.0): Executed 623 of 763 (4 FAILED) (0 secs / 8.092 secs)
HeadlessChrome 0.0.0 (Linux 0.0.0): Executed 624 of 763 (4 FAILED) (0 secs / 8.094 secs)
HeadlessChrome 0.0.0 (Linux 0.0.0): Executed 625 of 763 (4 FAILED) (0 secs / 8.097 secs)
HeadlessChrome 0.0.0 (Linux 0.0.0): Executed 626 of 763 (4 FAILED) (0 secs / 8.098 secs)
HeadlessChrome 0.0.0 (Linux 0.0.0): Executed 627 of 763 (4 FAILED) (0 secs / 8.1 secs)
HeadlessChrome 0.0.0 (Linux 0.0.0): Executed 628 of 763 (4 FAILED) (0 secs / 8.102 secs)
HeadlessChrome 0.0.0 (Linux 0.0.0): Executed 629 of 763 (4 FAILED) (0 secs / 8.104 secs)
HeadlessChrome 0.0.0 (Linux 0.0.0): Executed 630 of 763 (4 FAILED) (0 secs / 8.107 secs)
HeadlessChrome 0.0.0 (Linux 0.0.0): Executed 631 of 763 (4 FAILED) (0 secs / 8.108 secs)
HeadlessChrome 0.0.0 (Linux 0.0.0): Executed 632 of 763 (4 FAILED) (0 secs / 8.109 secs)
HeadlessChrome 0.0.0 (Linux 0.0.0): Executed 633 of 763 (4 FAILED) (0 secs / 8.111 secs)
HeadlessChrome 0.0.0 (Linux 0.0.0): Executed 634 of 763 (4 FAILED) (0 secs / 8.113 secs)
HeadlessChrome 0.0.0 (Linux 0.0.0): Executed 635 of 763 (4 FAILED) (0 secs / 8.115 secs)
HeadlessChrome 0.0.0 (Linux 0.0.0): Executed 636 of 763 (4 FAILED) (0 secs / 8.117 secs)
HeadlessChrome 0.0.0 (Linux 0.0.0): Executed 637 of 763 (4 FAILED) (0 secs / 8.12 secs)
HeadlessChrome 0.0.0 (Linux 0.0.0): Executed 638 of 763 (4 FAILED) (0 secs / 8.121 secs)
HeadlessChrome 0.0.0 (Linux 0.0.0): Executed 639 of 763 (4 FAILED) (0 secs / 8.125 secs)
HeadlessChrome 0.0.0 (Linux 0.0.0): Executed 640 of 763 (4 FAILED) (0 secs / 8.127 secs)
HeadlessChrome 0.0.0 (Linux 0.0.0): Executed 641 of 763 (4 FAILED) (0 secs / 8.131 secs)
HeadlessChrome 0.0.0 (Linux 0.0.0): Executed 642 of 763 (4 FAILED) (0 secs / 8.132 secs)
HeadlessChrome 0.0.0 (Linux 0.0.0): Executed 643 of 763 (4 FAILED) (0 secs / 8.134 secs)
HeadlessChrome 0.0.0 (Linux 0.0.0): Executed 644 of 763 (4 FAILED) (0 secs / 8.136 secs)
HeadlessChrome 0.0.0 (Linux 0.0.0): Executed 645 of 763 (4 FAILED) (0 secs / 8.139 secs)
HeadlessChrome 0.0.0 (Linux 0.0.0): Executed 646 of 763 (4 FAILED) (0 secs / 8.14 secs)
HeadlessChrome 0.0.0 (Linux 0.0.0): Executed 647 of 763 (4 FAILED) (0 secs / 8.142 secs)
HeadlessChrome 0.0.0 (Linux 0.0.0): Executed 648 of 763 (4 FAILED) (0 secs / 8.144 secs)
HeadlessChrome 0.0.0 (Linux 0.0.0): Executed 649 of 763 (4 FAILED) (0 secs / 8.146 secs)
HeadlessChrome 0.0.0 (Linux 0.0.0): Executed 650 of 763 (4 FAILED) (0 secs / 8.148 secs)
HeadlessChrome 0.0.0 (Linux 0.0.0): Executed 651 of 763 (4 FAILED) (0 secs / 8.149 secs)
HeadlessChrome 0.0.0 (Linux 0.0.0): Executed 652 of 763 (4 FAILED) (0 secs / 8.15 secs)
HeadlessChrome 0.0.0 (Linux 0.0.0): Executed 653 of 763 (4 FAILED) (0 secs / 8.153 secs)
HeadlessChrome 0.0.0 (Linux 0.0.0): Executed 654 of 763 (4 FAILED) (0 secs / 8.155 secs)
HeadlessChrome 0.0.0 (Linux 0.0.0): Executed 655 of 763 (4 FAILED) (0 secs / 8.157 secs)
HeadlessChrome 0.0.0 (Linux 0.0.0): Executed 656 of 763 (4 FAILED) (0 secs / 8.158 secs)
HeadlessChrome 0.0.0 (Linux 0.0.0): Executed 657 of 763 (4 FAILED) (0 secs / 8.16 secs)
HeadlessChrome 0.0.0 (Linux 0.0.0): Executed 658 of 763 (4 FAILED) (0 secs / 8.161 secs)
HeadlessChrome 0.0.0 (Linux 0.0.0): Executed 659 of 763 (4 FAILED) (0 secs / 8.164 secs)
HeadlessChrome 0.0.0 (Linux 0.0.0): Executed 660 of 763 (4 FAILED) (0 secs / 8.166 secs)
HeadlessChrome 0.0.0 (Linux 0.0.0): Executed 661 of 763 (4 FAILED) (0 secs / 8.168 secs)
HeadlessChrome 0.0.0 (Linux 0.0.0): Executed 662 of 763 (4 FAILED) (0 secs / 8.17 secs)
HeadlessChrome 0.0.0 (Linux 0.0.0): Executed 663 of 763 (4 FAILED) (0 secs / 8.171 secs)
HeadlessChrome 0.0.0 (Linux 0.0.0): Executed 664 of 763 (4 FAILED) (0 secs / 8.173 secs)
HeadlessChrome 0.0.0 (Linux 0.0.0): Executed 665 of 763 (4 FAILED) (0 secs / 8.175 secs)
HeadlessChrome 0.0.0 (Linux 0.0.0): Executed 666 of 763 (4 FAILED) (0 secs / 8.176 secs)
HeadlessChrome 0.0.0 (Linux 0.0.0): Executed 667 of 763 (4 FAILED) (0 secs / 8.179 secs)
HeadlessChrome 0.0.0 (Linux 0.0.0): Executed 668 of 763 (4 FAILED) (0 secs / 8.181 secs)
HeadlessChrome 0.0.0 (Linux 0.0.0): Executed 669 of 763 (4 FAILED) (0 secs / 8.184 secs)
HeadlessChrome 0.0.0 (Linux 0.0.0): Executed 670 of 763 (4 FAILED) (0 secs / 8.186 secs)
HeadlessChrome 0.0.0 (Linux 0.0.0): Executed 671 of 763 (4 FAILED) (0 secs / 8.189 secs)
HeadlessChrome 0.0.0 (Linux 0.0.0): Executed 672 of 763 (4 FAILED) (0 secs / 8.19 secs)
HeadlessChrome 0.0.0 (Linux 0.0.0): Executed 673 of 763 (4 FAILED) (0 secs / 8.192 secs)
HeadlessChrome 0.0.0 (Linux 0.0.0): Executed 674 of 763 (4 FAILED) (0 secs / 8.198 secs)
HeadlessChrome 0.0.0 (Linux 0.0.0): Executed 675 of 763 (4 FAILED) (0 secs / 8.199 secs)
HeadlessChrome 0.0.0 (Linux 0.0.0): Executed 676 of 763 (4 FAILED) (0 secs / 8.201 secs)
HeadlessChrome 0.0.0 (Linux 0.0.0): Executed 677 of 763 (4 FAILED) (0 secs / 8.207 secs)
HeadlessChrome 0.0.0 (Linux 0.0.0): Executed 678 of 763 (4 FAILED) (0 secs / 8.209 secs)
HeadlessChrome 0.0.0 (Linux 0.0.0): Executed 679 of 763 (4 FAILED) (0 secs / 8.214 secs)
HeadlessChrome 0.0.0 (Linux 0.0.0): Executed 680 of 763 (4 FAILED) (0 secs / 8.236 secs)
HeadlessChrome 0.0.0 (Linux 0.0.0): Executed 681 of 763 (4 FAILED) (0 secs / 8.24 secs)
HeadlessChrome 0.0.0 (Linux 0.0.0): Executed 682 of 763 (4 FAILED) (0 secs / 8.242 secs)
HeadlessChrome 0.0.0 (Linux 0.0.0): Executed 683 of 763 (4 FAILED) (0 secs / 8.263 secs)
HeadlessChrome 0.0.0 (Linux 0.0.0): Executed 684 of 763 (4 FAILED) (0 secs / 8.265 secs)
HeadlessChrome 0.0.0 (Linux 0.0.0): Executed 685 of 763 (4 FAILED) (0 secs / 8.267 secs)
HeadlessChrome 0.0.0 (Linux 0.0.0): Executed 686 of 763 (4 FAILED) (0 secs / 8.27 secs)
HeadlessChrome 0.0.0 (Linux 0.0.0): Executed 687 of 763 (4 FAILED) (0 secs / 8.292 secs)
HeadlessChrome 0.0.0 (Linux 0.0.0): Executed 688 of 763 (4 FAILED) (0 secs / 8.295 secs)
HeadlessChrome 0.0.0 (Linux 0.0.0): Executed 689 of 763 (4 FAILED) (0 secs / 8.3 secs)
HeadlessChrome 0.0.0 (Linux 0.0.0): Executed 690 of 763 (4 FAILED) (0 secs / 8.322 secs)
HeadlessChrome 0.0.0 (Linux 0.0.0): Executed 691 of 763 (4 FAILED) (0 secs / 8.325 secs)
HeadlessChrome 0.0.0 (Linux 0.0.0): Executed 692 of 763 (4 FAILED) (0 secs / 8.326 secs)
HeadlessChrome 0.0.0 (Linux 0.0.0): Executed 693 of 763 (4 FAILED) (0 secs / 8.33 secs)
HeadlessChrome 0.0.0 (Linux 0.0.0): Executed 694 of 763 (4 FAILED) (0 secs / 8.332 secs)
HeadlessChrome 0.0.0 (Linux 0.0.0): Executed 695 of 763 (4 FAILED) (0 secs / 8.333 secs)
HeadlessChrome 0.0.0 (Linux 0.0.0): Executed 696 of 763 (4 FAILED) (0 secs / 8.334 secs)
HeadlessChrome 0.0.0 (Linux 0.0.0): Executed 697 of 763 (4 FAILED) (0 secs / 8.336 secs)
HeadlessChrome 0.0.0 (Linux 0.0.0): Executed 698 of 763 (4 FAILED) (0 secs / 8.339 secs)
HeadlessChrome 0.0.0 (Linux 0.0.0): Executed 699 of 763 (4 FAILED) (0 secs / 8.342 secs)
HeadlessChrome 0.0.0 (Linux 0.0.0): Executed 700 of 763 (4 FAILED) (0 secs / 8.343 secs)
HeadlessChrome 0.0.0 (Linux 0.0.0): Executed 701 of 763 (4 FAILED) (0 secs / 8.345 secs)
HeadlessChrome 0.0.0 (Linux 0.0.0): Executed 702 of 763 (4 FAILED) (0 secs / 8.347 secs)
HeadlessChrome 0.0.0 (Linux 0.0.0): Executed 703 of 763 (4 FAILED) (0 secs / 8.349 secs)
HeadlessChrome 0.0.0 (Linux 0.0.0): Executed 704 of 763 (4 FAILED) (0 secs / 8.351 secs)
HeadlessChrome 0.0.0 (Linux 0.0.0): Executed 705 of 763 (4 FAILED) (0 secs / 8.356 secs)
HeadlessChrome 0.0.0 (Linux 0.0.0): Executed 706 of 763 (4 FAILED) (0 secs / 8.358 secs)
HeadlessChrome 0.0.0 (Linux 0.0.0): Executed 707 of 763 (4 FAILED) (0 secs / 8.36 secs)
HeadlessChrome 0.0.0 (Linux 0.0.0): Executed 708 of 763 (4 FAILED) (0 secs / 8.362 secs)
HeadlessChrome 0.0.0 (Linux 0.0.0): Executed 709 of 763 (4 FAILED) (0 secs / 8.363 secs)
HeadlessChrome 0.0.0 (Linux 0.0.0): Executed 710 of 763 (4 FAILED) (0 secs / 8.365 secs)
HeadlessChrome 0.0.0 (Linux 0.0.0): Executed 711 of 763 (4 FAILED) (0 secs / 8.366 secs)
HeadlessChrome 0.0.0 (Linux 0.0.0): Executed 712 of 763 (4 FAILED) (0 secs / 8.37 secs)
HeadlessChrome 0.0.0 (Linux 0.0.0): Executed 713 of 763 (4 FAILED) (0 secs / 8.371 secs)
HeadlessChrome 0.0.0 (Linux 0.0.0): Executed 714 of 763 (4 FAILED) (0 secs / 8.395 secs)
HeadlessChrome 0.0.0 (Linux 0.0.0): Executed 715 of 763 (4 FAILED) (0 secs / 8.396 secs)
HeadlessChrome 0.0.0 (Linux 0.0.0): Executed 716 of 763 (4 FAILED) (0 secs / 8.418 secs)
HeadlessChrome 0.0.0 (Linux 0.0.0): Executed 717 of 763 (4 FAILED) (0 secs / 8.421 secs)
HeadlessChrome 0.0.0 (Linux 0.0.0): Executed 718 of 763 (4 FAILED) (0 secs / 8.422 secs)
HeadlessChrome 0.0.0 (Linux 0.0.0): Executed 719 of 763 (4 FAILED) (0 secs / 8.424 secs)
HeadlessChrome 0.0.0 (Linux 0.0.0): Executed 720 of 763 (4 FAILED) (0 secs / 8.426 secs)
HeadlessChrome 0.0.0 (Linux 0.0.0): Executed 721 of 763 (4 FAILED) (0 secs / 8.427 secs)
HeadlessChrome 0.0.0 (Linux 0.0.0): Executed 722 of 763 (4 FAILED) (0 secs / 8.429 secs)
HeadlessChrome 0.0.0 (Linux 0.0.0): Executed 723 of 763 (4 FAILED) (0 secs / 8.43 secs)
HeadlessChrome 0.0.0 (Linux 0.0.0): Executed 724 of 763 (4 FAILED) (0 secs / 8.434 secs)
HeadlessChrome 0.0.0 (Linux 0.0.0): Executed 725 of 763 (4 FAILED) (0 secs / 8.436 secs)
HeadlessChrome 0.0.0 (Linux 0.0.0): Executed 726 of 763 (4 FAILED) (0 secs / 8.437 secs)
HeadlessChrome 0.0.0 (Linux 0.0.0): Executed 727 of 763 (4 FAILED) (0 secs / 8.439 secs)
HeadlessChrome 0.0.0 (Linux 0.0.0): Executed 728 of 763 (4 FAILED) (0 secs / 8.441 secs)
HeadlessChrome 0.0.0 (Linux 0.0.0): Executed 729 of 763 (4 FAILED) (0 secs / 8.443 secs)
HeadlessChrome 0.0.0 (Linux 0.0.0): Executed 730 of 763 (4 FAILED) (0 secs / 8.444 secs)
HeadlessChrome 0.0.0 (Linux 0.0.0): Executed 731 of 763 (4 FAILED) (0 secs / 8.447 secs)
HeadlessChrome 0.0.0 (Linux 0.0.0): Executed 732 of 763 (4 FAILED) (0 secs / 8.447 secs)
HeadlessChrome 0.0.0 (Linux 0.0.0): Executed 733 of 763 (4 FAILED) (0 secs / 8.45 secs)
HeadlessChrome 0.0.0 (Linux 0.0.0): Executed 734 of 763 (4 FAILED) (0 secs / 8.452 secs)
HeadlessChrome 0.0.0 (Linux 0.0.0): Executed 735 of 763 (4 FAILED) (0 secs / 8.454 secs)
HeadlessChrome 0.0.0 (Linux 0.0.0): Executed 736 of 763 (4 FAILED) (0 secs / 8.457 secs)
HeadlessChrome 0.0.0 (Linux 0.0.0): Executed 737 of 763 (4 FAILED) (0 secs / 8.459 secs)
HeadlessChrome 0.0.0 (Linux 0.0.0): Executed 738 of 763 (4 FAILED) (0 secs / 8.461 secs)
HeadlessChrome 0.0.0 (Linux 0.0.0): Executed 739 of 763 (4 FAILED) (0 secs / 8.463 secs)
HeadlessChrome 0.0.0 (Linux 0.0.0): Executed 740 of 763 (4 FAILED) (0 secs / 8.464 secs)
HeadlessChrome 0.0.0 (Linux 0.0.0): Executed 741 of 763 (4 FAILED) (0 secs / 8.464 secs)
HeadlessChrome 0.0.0 (Linux 0.0.0): Executed 742 of 763 (4 FAILED) (0 secs / 8.466 secs)
HeadlessChrome 0.0.0 (Linux 0.0.0): Executed 743 of 763 (4 FAILED) (0 secs / 8.467 secs)
HeadlessChrome 0.0.0 (Linux 0.0.0): Executed 744 of 763 (4 FAILED) (0 secs / 8.468 secs)
HeadlessChrome 0.0.0 (Linux 0.0.0): Executed 745 of 763 (4 FAILED) (0 secs / 8.47 secs)
HeadlessChrome 0.0.0 (Linux 0.0.0): Executed 746 of 763 (4 FAILED) (0 secs / 8.471 secs)
HeadlessChrome 0.0.0 (Linux 0.0.0): Executed 747 of 763 (4 FAILED) (0 secs / 8.477 secs)
HeadlessChrome 0.0.0 (Linux 0.0.0): Executed 748 of 763 (4 FAILED) (0 secs / 8.478 secs)
HeadlessChrome 0.0.0 (Linux 0.0.0): Executed 749 of 763 (4 FAILED) (0 secs / 8.481 secs)
HeadlessChrome 0.0.0 (Linux 0.0.0): Executed 750 of 763 (4 FAILED) (0 secs / 8.483 secs)
HeadlessChrome 0.0.0 (Linux 0.0.0): Executed 751 of 763 (4 FAILED) (0 secs / 8.484 secs)
HeadlessChrome 0.0.0 (Linux 0.0.0): Executed 752 of 763 (4 FAILED) (0 secs / 8.486 secs)
HeadlessChrome 0.0.0 (Linux 0.0.0): Executed 753 of 763 (4 FAILED) (0 secs / 8.49 secs)
HeadlessChrome 0.0.0 (Linux 0.0.0): Executed 754 of 763 (4 FAILED) (0 secs / 8.491 secs)
HeadlessChrome 0.0.0 (Linux 0.0.0): Executed 755 of 763 (4 FAILED) (0 secs / 8.493 secs)
HeadlessChrome 0.0.0 (Linux 0.0.0): Executed 756 of 763 (4 FAILED) (0 secs / 8.494 secs)
HeadlessChrome 0.0.0 (Linux 0.0.0): Executed 757 of 763 (4 FAILED) (0 secs / 8.495 secs)
HeadlessChrome 0.0.0 (Linux 0.0.0): Executed 758 of 763 (4 FAILED) (0 secs / 8.498 secs)
HeadlessChrome 0.0.0 (Linux 0.0.0): Executed 759 of 763 (4 FAILED) (0 secs / 8.499 secs)
HeadlessChrome 0.0.0 (Linux 0.0.0): Executed 760 of 763 (4 FAILED) (0 secs / 8.502 secs)
HeadlessChrome 0.0.0 (Linux 0.0.0): Executed 761 of 763 (4 FAILED) (0 secs / 8.504 secs)
HeadlessChrome 0.0.0 (Linux 0.0.0): Executed 762 of 763 (4 FAILED) (0 secs / 8.506 secs)
HeadlessChrome 0.0.0 (Linux 0.0.0): Executed 763 of 763 (4 FAILED) (0 secs / 8.508 secs)
HeadlessChrome 0.0.0 (Linux 0.0.0): Executed 763 of 763 (4 FAILED) (8.885 secs / 8.508 secs)
ERROR: Error detected when running the Jasmine tests.
ERROR: Error detected when running the Jasmine tests.
Build step 'Execute shell' marked build as failure

Reply | Threaded
Open this post in threaded view
|

Jenkins build is back to normal : pgadmin4-master-python35 #850

pgAdmin 4 Jenkins