Build failed in Jenkins: pgadmin4-master-python37 #96

classic Classic list List threaded Threaded
2 messages Options
Reply | Threaded
Open this post in threaded view
|

Build failed in Jenkins: pgadmin4-master-python37 #96

pgAdmin 4 Jenkins
See <https://jenkins.pgadmin.org/job/pgadmin4-master-python37/96/display/redirect?page=changes>

Changes:

[Dave Page] Fix help for the backup/restore dialogues. Fixes #3861

[Dave Page] Don't show system catalogs in the schemas property list unless show

[Dave Page] Ensure the context menu works after a server is renamed. Fixes #3575

------------------------------------------
[...truncated 1013.30 KB...]
HeadlessChrome 0.0.0 (Linux 0.0.0): Executed 519 of 763 (4 FAILED) (0 secs / 9.43 secs)
HeadlessChrome 0.0.0 (Linux 0.0.0): Executed 520 of 763 (4 FAILED) (0 secs / 9.433 secs)
HeadlessChrome 0.0.0 (Linux 0.0.0): Executed 521 of 763 (4 FAILED) (0 secs / 9.437 secs)
HeadlessChrome 0.0.0 (Linux 0.0.0): Executed 522 of 763 (4 FAILED) (0 secs / 9.443 secs)
HeadlessChrome 0.0.0 (Linux 0.0.0): Executed 523 of 763 (4 FAILED) (0 secs / 9.447 secs)
HeadlessChrome 0.0.0 (Linux 0.0.0): Executed 524 of 763 (4 FAILED) (0 secs / 9.45 secs)
HeadlessChrome 0.0.0 (Linux 0.0.0): Executed 525 of 763 (4 FAILED) (0 secs / 9.454 secs)
HeadlessChrome 0.0.0 (Linux 0.0.0): Executed 526 of 763 (4 FAILED) (0 secs / 9.462 secs)
HeadlessChrome 0.0.0 (Linux 0.0.0): Executed 527 of 763 (4 FAILED) (0 secs / 9.465 secs)
HeadlessChrome 0.0.0 (Linux 0.0.0): Executed 528 of 763 (4 FAILED) (0 secs / 9.468 secs)
HeadlessChrome 0.0.0 (Linux 0.0.0): Executed 529 of 763 (4 FAILED) (0 secs / 9.471 secs)
HeadlessChrome 0.0.0 (Linux 0.0.0): Executed 530 of 763 (4 FAILED) (0 secs / 9.475 secs)
HeadlessChrome 0.0.0 (Linux 0.0.0): Executed 531 of 763 (4 FAILED) (0 secs / 9.477 secs)
HeadlessChrome 0.0.0 (Linux 0.0.0): Executed 532 of 763 (4 FAILED) (0 secs / 9.479 secs)
HeadlessChrome 0.0.0 (Linux 0.0.0): Executed 533 of 763 (4 FAILED) (0 secs / 9.483 secs)
HeadlessChrome 0.0.0 (Linux 0.0.0): Executed 534 of 763 (4 FAILED) (0 secs / 9.488 secs)
HeadlessChrome 0.0.0 (Linux 0.0.0): Executed 535 of 763 (4 FAILED) (0 secs / 9.496 secs)
HeadlessChrome 0.0.0 (Linux 0.0.0): Executed 536 of 763 (4 FAILED) (0 secs / 9.499 secs)
HeadlessChrome 0.0.0 (Linux 0.0.0): Executed 537 of 763 (4 FAILED) (0 secs / 9.503 secs)
HeadlessChrome 0.0.0 (Linux 0.0.0): Executed 538 of 763 (4 FAILED) (0 secs / 9.508 secs)
HeadlessChrome 0.0.0 (Linux 0.0.0): Executed 539 of 763 (4 FAILED) (0 secs / 9.512 secs)
HeadlessChrome 0.0.0 (Linux 0.0.0): Executed 540 of 763 (4 FAILED) (0 secs / 9.516 secs)
HeadlessChrome 0.0.0 (Linux 0.0.0): Executed 541 of 763 (4 FAILED) (0 secs / 9.519 secs)
HeadlessChrome 0.0.0 (Linux 0.0.0): Executed 542 of 763 (4 FAILED) (0 secs / 9.531 secs)
HeadlessChrome 0.0.0 (Linux 0.0.0): Executed 543 of 763 (4 FAILED) (0 secs / 9.538 secs)
HeadlessChrome 0.0.0 (Linux 0.0.0): Executed 544 of 763 (4 FAILED) (0 secs / 9.542 secs)
HeadlessChrome 0.0.0 (Linux 0.0.0): Executed 545 of 763 (4 FAILED) (0 secs / 9.545 secs)
HeadlessChrome 0.0.0 (Linux 0.0.0): Executed 546 of 763 (4 FAILED) (0 secs / 9.549 secs)
HeadlessChrome 0.0.0 (Linux 0.0.0): Executed 547 of 763 (4 FAILED) (0 secs / 9.553 secs)
HeadlessChrome 0.0.0 (Linux 0.0.0): Executed 548 of 763 (4 FAILED) (0 secs / 9.557 secs)
HeadlessChrome 0.0.0 (Linux 0.0.0): Executed 549 of 763 (4 FAILED) (0 secs / 9.563 secs)
HeadlessChrome 0.0.0 (Linux 0.0.0): Executed 550 of 763 (4 FAILED) (0 secs / 9.569 secs)
HeadlessChrome 0.0.0 (Linux 0.0.0): Executed 551 of 763 (4 FAILED) (0 secs / 9.573 secs)
HeadlessChrome 0.0.0 (Linux 0.0.0): Executed 552 of 763 (4 FAILED) (0 secs / 9.577 secs)
HeadlessChrome 0.0.0 (Linux 0.0.0): Executed 553 of 763 (4 FAILED) (0 secs / 9.581 secs)
HeadlessChrome 0.0.0 (Linux 0.0.0): Executed 554 of 763 (4 FAILED) (0 secs / 9.586 secs)
HeadlessChrome 0.0.0 (Linux 0.0.0): Executed 555 of 763 (4 FAILED) (0 secs / 9.59 secs)
HeadlessChrome 0.0.0 (Linux 0.0.0): Executed 556 of 763 (4 FAILED) (0 secs / 9.593 secs)
HeadlessChrome 0.0.0 (Linux 0.0.0): Executed 557 of 763 (4 FAILED) (0 secs / 9.595 secs)
HeadlessChrome 0.0.0 (Linux 0.0.0): Executed 558 of 763 (4 FAILED) (0 secs / 9.599 secs)
HeadlessChrome 0.0.0 (Linux 0.0.0): Executed 559 of 763 (4 FAILED) (0 secs / 9.602 secs)
HeadlessChrome 0.0.0 (Linux 0.0.0): Executed 560 of 763 (4 FAILED) (0 secs / 9.605 secs)
HeadlessChrome 0.0.0 (Linux 0.0.0): Executed 561 of 763 (4 FAILED) (0 secs / 9.609 secs)
HeadlessChrome 0.0.0 (Linux 0.0.0): Executed 562 of 763 (4 FAILED) (0 secs / 9.614 secs)
HeadlessChrome 0.0.0 (Linux 0.0.0): Executed 563 of 763 (4 FAILED) (0 secs / 9.617 secs)
HeadlessChrome 0.0.0 (Linux 0.0.0): Executed 564 of 763 (4 FAILED) (0 secs / 9.621 secs)
HeadlessChrome 0.0.0 (Linux 0.0.0): Executed 565 of 763 (4 FAILED) (0 secs / 9.625 secs)
HeadlessChrome 0.0.0 (Linux 0.0.0): Executed 566 of 763 (4 FAILED) (0 secs / 9.631 secs)
HeadlessChrome 0.0.0 (Linux 0.0.0): Executed 567 of 763 (4 FAILED) (0 secs / 9.638 secs)
HeadlessChrome 0.0.0 (Linux 0.0.0): Executed 568 of 763 (4 FAILED) (0 secs / 9.641 secs)
HeadlessChrome 0.0.0 (Linux 0.0.0): Executed 569 of 763 (4 FAILED) (0 secs / 9.644 secs)
HeadlessChrome 0.0.0 (Linux 0.0.0): Executed 570 of 763 (4 FAILED) (0 secs / 9.648 secs)
HeadlessChrome 0.0.0 (Linux 0.0.0): Executed 571 of 763 (4 FAILED) (0 secs / 9.652 secs)
HeadlessChrome 0.0.0 (Linux 0.0.0): Executed 572 of 763 (4 FAILED) (0 secs / 9.656 secs)
HeadlessChrome 0.0.0 (Linux 0.0.0): Executed 573 of 763 (4 FAILED) (0 secs / 9.661 secs)
HeadlessChrome 0.0.0 (Linux 0.0.0): Executed 574 of 763 (4 FAILED) (0 secs / 9.665 secs)
HeadlessChrome 0.0.0 (Linux 0.0.0): Executed 575 of 763 (4 FAILED) (0 secs / 9.668 secs)
HeadlessChrome 0.0.0 (Linux 0.0.0): Executed 576 of 763 (4 FAILED) (0 secs / 9.67 secs)
HeadlessChrome 0.0.0 (Linux 0.0.0): Executed 577 of 763 (4 FAILED) (0 secs / 9.673 secs)
HeadlessChrome 0.0.0 (Linux 0.0.0): Executed 578 of 763 (4 FAILED) (0 secs / 9.676 secs)
HeadlessChrome 0.0.0 (Linux 0.0.0): Executed 579 of 763 (4 FAILED) (0 secs / 9.68 secs)
HeadlessChrome 0.0.0 (Linux 0.0.0): Executed 580 of 763 (4 FAILED) (0 secs / 9.681 secs)
HeadlessChrome 0.0.0 (Linux 0.0.0): Executed 581 of 763 (4 FAILED) (0 secs / 9.682 secs)
HeadlessChrome 0.0.0 (Linux 0.0.0): Executed 582 of 763 (4 FAILED) (0 secs / 9.684 secs)
HeadlessChrome 0.0.0 (Linux 0.0.0): Executed 583 of 763 (4 FAILED) (0 secs / 9.686 secs)
HeadlessChrome 0.0.0 (Linux 0.0.0): Executed 584 of 763 (4 FAILED) (0 secs / 9.687 secs)
HeadlessChrome 0.0.0 (Linux 0.0.0): Executed 585 of 763 (4 FAILED) (0 secs / 9.69 secs)
HeadlessChrome 0.0.0 (Linux 0.0.0): Executed 586 of 763 (4 FAILED) (0 secs / 9.692 secs)
HeadlessChrome 0.0.0 (Linux 0.0.0): Executed 587 of 763 (4 FAILED) (0 secs / 9.695 secs)
HeadlessChrome 0.0.0 (Linux 0.0.0): Executed 588 of 763 (4 FAILED) (0 secs / 9.696 secs)
HeadlessChrome 0.0.0 (Linux 0.0.0): Executed 589 of 763 (4 FAILED) (0 secs / 9.698 secs)
HeadlessChrome 0.0.0 (Linux 0.0.0): Executed 590 of 763 (4 FAILED) (0 secs / 9.7 secs)
HeadlessChrome 0.0.0 (Linux 0.0.0): Executed 591 of 763 (4 FAILED) (0 secs / 9.702 secs)
HeadlessChrome 0.0.0 (Linux 0.0.0): Executed 592 of 763 (4 FAILED) (0 secs / 9.705 secs)
HeadlessChrome 0.0.0 (Linux 0.0.0): Executed 593 of 763 (4 FAILED) (0 secs / 9.706 secs)
HeadlessChrome 0.0.0 (Linux 0.0.0): Executed 594 of 763 (4 FAILED) (0 secs / 9.708 secs)
HeadlessChrome 0.0.0 (Linux 0.0.0): Executed 595 of 763 (4 FAILED) (0 secs / 9.709 secs)
HeadlessChrome 0.0.0 (Linux 0.0.0): Executed 596 of 763 (4 FAILED) (0 secs / 9.711 secs)
HeadlessChrome 0.0.0 (Linux 0.0.0): Executed 597 of 763 (4 FAILED) (0 secs / 9.713 secs)
HeadlessChrome 0.0.0 (Linux 0.0.0): Executed 598 of 763 (4 FAILED) (0 secs / 9.714 secs)
HeadlessChrome 0.0.0 (Linux 0.0.0): Executed 599 of 763 (4 FAILED) (0 secs / 9.716 secs)
HeadlessChrome 0.0.0 (Linux 0.0.0): Executed 600 of 763 (4 FAILED) (0 secs / 9.718 secs)
HeadlessChrome 0.0.0 (Linux 0.0.0): Executed 601 of 763 (4 FAILED) (0 secs / 9.721 secs)
HeadlessChrome 0.0.0 (Linux 0.0.0): Executed 602 of 763 (4 FAILED) (0 secs / 9.723 secs)
HeadlessChrome 0.0.0 (Linux 0.0.0): Executed 603 of 763 (4 FAILED) (0 secs / 9.724 secs)
HeadlessChrome 0.0.0 (Linux 0.0.0): Executed 604 of 763 (4 FAILED) (0 secs / 9.725 secs)
HeadlessChrome 0.0.0 (Linux 0.0.0): Executed 605 of 763 (4 FAILED) (0 secs / 9.727 secs)
HeadlessChrome 0.0.0 (Linux 0.0.0): Executed 606 of 763 (4 FAILED) (0 secs / 9.728 secs)
HeadlessChrome 0.0.0 (Linux 0.0.0): Executed 607 of 763 (4 FAILED) (0 secs / 9.732 secs)
HeadlessChrome 0.0.0 (Linux 0.0.0): Executed 608 of 763 (4 FAILED) (0 secs / 9.733 secs)
HeadlessChrome 0.0.0 (Linux 0.0.0): Executed 609 of 763 (4 FAILED) (0 secs / 9.735 secs)
HeadlessChrome 0.0.0 (Linux 0.0.0): Executed 610 of 763 (4 FAILED) (0 secs / 9.737 secs)
HeadlessChrome 0.0.0 (Linux 0.0.0): Executed 611 of 763 (4 FAILED) (0 secs / 9.738 secs)
HeadlessChrome 0.0.0 (Linux 0.0.0): Executed 612 of 763 (4 FAILED) (0 secs / 9.74 secs)
HeadlessChrome 0.0.0 (Linux 0.0.0): Executed 613 of 763 (4 FAILED) (0 secs / 9.741 secs)
HeadlessChrome 0.0.0 (Linux 0.0.0): Executed 614 of 763 (4 FAILED) (0 secs / 9.742 secs)
HeadlessChrome 0.0.0 (Linux 0.0.0): Executed 615 of 763 (4 FAILED) (0 secs / 9.745 secs)
HeadlessChrome 0.0.0 (Linux 0.0.0): Executed 616 of 763 (4 FAILED) (0 secs / 9.747 secs)
HeadlessChrome 0.0.0 (Linux 0.0.0): Executed 617 of 763 (4 FAILED) (0 secs / 9.749 secs)
HeadlessChrome 0.0.0 (Linux 0.0.0): Executed 618 of 763 (4 FAILED) (0 secs / 9.749 secs)
HeadlessChrome 0.0.0 (Linux 0.0.0): Executed 619 of 763 (4 FAILED) (0 secs / 9.751 secs)
HeadlessChrome 0.0.0 (Linux 0.0.0): Executed 620 of 763 (4 FAILED) (0 secs / 9.752 secs)
HeadlessChrome 0.0.0 (Linux 0.0.0): Executed 621 of 763 (4 FAILED) (0 secs / 9.754 secs)
HeadlessChrome 0.0.0 (Linux 0.0.0): Executed 622 of 763 (4 FAILED) (0 secs / 9.757 secs)
HeadlessChrome 0.0.0 (Linux 0.0.0): Executed 623 of 763 (4 FAILED) (0 secs / 9.759 secs)
HeadlessChrome 0.0.0 (Linux 0.0.0): Executed 624 of 763 (4 FAILED) (0 secs / 9.76 secs)
HeadlessChrome 0.0.0 (Linux 0.0.0): Executed 625 of 763 (4 FAILED) (0 secs / 9.761 secs)
HeadlessChrome 0.0.0 (Linux 0.0.0): Executed 626 of 763 (4 FAILED) (0 secs / 9.763 secs)
HeadlessChrome 0.0.0 (Linux 0.0.0): Executed 627 of 763 (4 FAILED) (0 secs / 9.766 secs)
HeadlessChrome 0.0.0 (Linux 0.0.0): Executed 628 of 763 (4 FAILED) (0 secs / 9.767 secs)
HeadlessChrome 0.0.0 (Linux 0.0.0): Executed 629 of 763 (4 FAILED) (0 secs / 9.77 secs)
HeadlessChrome 0.0.0 (Linux 0.0.0): Executed 630 of 763 (4 FAILED) (0 secs / 9.772 secs)
HeadlessChrome 0.0.0 (Linux 0.0.0): Executed 631 of 763 (4 FAILED) (0 secs / 9.774 secs)
HeadlessChrome 0.0.0 (Linux 0.0.0): Executed 632 of 763 (4 FAILED) (0 secs / 9.776 secs)
HeadlessChrome 0.0.0 (Linux 0.0.0): Executed 633 of 763 (4 FAILED) (0 secs / 9.777 secs)
HeadlessChrome 0.0.0 (Linux 0.0.0): Executed 634 of 763 (4 FAILED) (0 secs / 9.779 secs)
HeadlessChrome 0.0.0 (Linux 0.0.0): Executed 635 of 763 (4 FAILED) (0 secs / 9.782 secs)
HeadlessChrome 0.0.0 (Linux 0.0.0): Executed 636 of 763 (4 FAILED) (0 secs / 9.785 secs)
HeadlessChrome 0.0.0 (Linux 0.0.0): Executed 637 of 763 (4 FAILED) (0 secs / 9.788 secs)
HeadlessChrome 0.0.0 (Linux 0.0.0): Executed 638 of 763 (4 FAILED) (0 secs / 9.79 secs)
HeadlessChrome 0.0.0 (Linux 0.0.0): Executed 639 of 763 (4 FAILED) (0 secs / 9.791 secs)
HeadlessChrome 0.0.0 (Linux 0.0.0): Executed 640 of 763 (4 FAILED) (0 secs / 9.796 secs)
HeadlessChrome 0.0.0 (Linux 0.0.0): Executed 641 of 763 (4 FAILED) (0 secs / 9.798 secs)
HeadlessChrome 0.0.0 (Linux 0.0.0): Executed 642 of 763 (4 FAILED) (0 secs / 9.799 secs)
HeadlessChrome 0.0.0 (Linux 0.0.0): Executed 643 of 763 (4 FAILED) (0 secs / 9.8 secs)
HeadlessChrome 0.0.0 (Linux 0.0.0): Executed 644 of 763 (4 FAILED) (0 secs / 9.802 secs)
HeadlessChrome 0.0.0 (Linux 0.0.0): Executed 645 of 763 (4 FAILED) (0 secs / 9.804 secs)
HeadlessChrome 0.0.0 (Linux 0.0.0): Executed 646 of 763 (4 FAILED) (0 secs / 9.808 secs)
HeadlessChrome 0.0.0 (Linux 0.0.0): Executed 647 of 763 (4 FAILED) (0 secs / 9.81 secs)
HeadlessChrome 0.0.0 (Linux 0.0.0): Executed 648 of 763 (4 FAILED) (0 secs / 9.812 secs)
HeadlessChrome 0.0.0 (Linux 0.0.0): Executed 649 of 763 (4 FAILED) (0 secs / 9.816 secs)
HeadlessChrome 0.0.0 (Linux 0.0.0): Executed 650 of 763 (4 FAILED) (0 secs / 9.817 secs)
HeadlessChrome 0.0.0 (Linux 0.0.0): Executed 651 of 763 (4 FAILED) (0 secs / 9.819 secs)
HeadlessChrome 0.0.0 (Linux 0.0.0): Executed 652 of 763 (4 FAILED) (0 secs / 9.821 secs)
HeadlessChrome 0.0.0 (Linux 0.0.0): Executed 653 of 763 (4 FAILED) (0 secs / 9.824 secs)
HeadlessChrome 0.0.0 (Linux 0.0.0): Executed 654 of 763 (4 FAILED) (0 secs / 9.826 secs)
HeadlessChrome 0.0.0 (Linux 0.0.0): Executed 655 of 763 (4 FAILED) (0 secs / 9.828 secs)
HeadlessChrome 0.0.0 (Linux 0.0.0): Executed 656 of 763 (4 FAILED) (0 secs / 9.829 secs)
HeadlessChrome 0.0.0 (Linux 0.0.0): Executed 657 of 763 (4 FAILED) (0 secs / 9.831 secs)
HeadlessChrome 0.0.0 (Linux 0.0.0): Executed 658 of 763 (4 FAILED) (0 secs / 9.833 secs)
HeadlessChrome 0.0.0 (Linux 0.0.0): Executed 659 of 763 (4 FAILED) (0 secs / 9.835 secs)
HeadlessChrome 0.0.0 (Linux 0.0.0): Executed 660 of 763 (4 FAILED) (0 secs / 9.838 secs)
HeadlessChrome 0.0.0 (Linux 0.0.0): Executed 661 of 763 (4 FAILED) (0 secs / 9.84 secs)
HeadlessChrome 0.0.0 (Linux 0.0.0): Executed 662 of 763 (4 FAILED) (0 secs / 9.842 secs)
HeadlessChrome 0.0.0 (Linux 0.0.0): Executed 663 of 763 (4 FAILED) (0 secs / 9.843 secs)
HeadlessChrome 0.0.0 (Linux 0.0.0): Executed 664 of 763 (4 FAILED) (0 secs / 9.844 secs)
HeadlessChrome 0.0.0 (Linux 0.0.0): Executed 665 of 763 (4 FAILED) (0 secs / 9.846 secs)
HeadlessChrome 0.0.0 (Linux 0.0.0): Executed 666 of 763 (4 FAILED) (0 secs / 9.848 secs)
HeadlessChrome 0.0.0 (Linux 0.0.0): Executed 667 of 763 (4 FAILED) (0 secs / 9.852 secs)
HeadlessChrome 0.0.0 (Linux 0.0.0): Executed 668 of 763 (4 FAILED) (0 secs / 9.854 secs)
HeadlessChrome 0.0.0 (Linux 0.0.0): Executed 669 of 763 (4 FAILED) (0 secs / 9.856 secs)
HeadlessChrome 0.0.0 (Linux 0.0.0): Executed 670 of 763 (4 FAILED) (0 secs / 9.857 secs)
HeadlessChrome 0.0.0 (Linux 0.0.0): Executed 671 of 763 (4 FAILED) (0 secs / 9.86 secs)
HeadlessChrome 0.0.0 (Linux 0.0.0): Executed 672 of 763 (4 FAILED) (0 secs / 9.862 secs)
HeadlessChrome 0.0.0 (Linux 0.0.0): Executed 673 of 763 (4 FAILED) (0 secs / 9.864 secs)
HeadlessChrome 0.0.0 (Linux 0.0.0): Executed 674 of 763 (4 FAILED) (0 secs / 9.866 secs)
HeadlessChrome 0.0.0 (Linux 0.0.0): Executed 675 of 763 (4 FAILED) (0 secs / 9.867 secs)
HeadlessChrome 0.0.0 (Linux 0.0.0): Executed 676 of 763 (4 FAILED) (0 secs / 9.871 secs)
HeadlessChrome 0.0.0 (Linux 0.0.0): Executed 677 of 763 (4 FAILED) (0 secs / 9.875 secs)
HeadlessChrome 0.0.0 (Linux 0.0.0): Executed 678 of 763 (4 FAILED) (0 secs / 9.877 secs)
HeadlessChrome 0.0.0 (Linux 0.0.0): Executed 679 of 763 (4 FAILED) (0 secs / 9.884 secs)
HeadlessChrome 0.0.0 (Linux 0.0.0): Executed 680 of 763 (4 FAILED) (0 secs / 9.906 secs)
HeadlessChrome 0.0.0 (Linux 0.0.0): Executed 681 of 763 (4 FAILED) (0 secs / 9.908 secs)
HeadlessChrome 0.0.0 (Linux 0.0.0): Executed 682 of 763 (4 FAILED) (0 secs / 9.912 secs)
HeadlessChrome 0.0.0 (Linux 0.0.0): Executed 683 of 763 (4 FAILED) (0 secs / 9.935 secs)
HeadlessChrome 0.0.0 (Linux 0.0.0): Executed 684 of 763 (4 FAILED) (0 secs / 9.938 secs)
HeadlessChrome 0.0.0 (Linux 0.0.0): Executed 685 of 763 (4 FAILED) (0 secs / 9.939 secs)
HeadlessChrome 0.0.0 (Linux 0.0.0): Executed 686 of 763 (4 FAILED) (0 secs / 9.944 secs)
HeadlessChrome 0.0.0 (Linux 0.0.0): Executed 687 of 763 (4 FAILED) (0 secs / 9.966 secs)
HeadlessChrome 0.0.0 (Linux 0.0.0): Executed 688 of 763 (4 FAILED) (0 secs / 9.969 secs)
HeadlessChrome 0.0.0 (Linux 0.0.0): Executed 689 of 763 (4 FAILED) (0 secs / 9.972 secs)
HeadlessChrome 0.0.0 (Linux 0.0.0): Executed 690 of 763 (4 FAILED) (0 secs / 9.994 secs)
HeadlessChrome 0.0.0 (Linux 0.0.0): Executed 691 of 763 (4 FAILED) (0 secs / 9.998 secs)
HeadlessChrome 0.0.0 (Linux 0.0.0): Executed 692 of 763 (4 FAILED) (0 secs / 10 secs)
HeadlessChrome 0.0.0 (Linux 0.0.0): Executed 693 of 763 (4 FAILED) (0 secs / 10.001 secs)
HeadlessChrome 0.0.0 (Linux 0.0.0): Executed 694 of 763 (4 FAILED) (0 secs / 10.004 secs)
HeadlessChrome 0.0.0 (Linux 0.0.0): Executed 695 of 763 (4 FAILED) (0 secs / 10.006 secs)
HeadlessChrome 0.0.0 (Linux 0.0.0): Executed 696 of 763 (4 FAILED) (0 secs / 10.007 secs)
HeadlessChrome 0.0.0 (Linux 0.0.0): Executed 697 of 763 (4 FAILED) (0 secs / 10.01 secs)
HeadlessChrome 0.0.0 (Linux 0.0.0): Executed 698 of 763 (4 FAILED) (0 secs / 10.012 secs)
HeadlessChrome 0.0.0 (Linux 0.0.0): Executed 699 of 763 (4 FAILED) (0 secs / 10.013 secs)
HeadlessChrome 0.0.0 (Linux 0.0.0): Executed 700 of 763 (4 FAILED) (0 secs / 10.014 secs)
HeadlessChrome 0.0.0 (Linux 0.0.0): Executed 701 of 763 (4 FAILED) (0 secs / 10.017 secs)
HeadlessChrome 0.0.0 (Linux 0.0.0): Executed 702 of 763 (4 FAILED) (0 secs / 10.018 secs)
HeadlessChrome 0.0.0 (Linux 0.0.0): Executed 703 of 763 (4 FAILED) (0 secs / 10.021 secs)
HeadlessChrome 0.0.0 (Linux 0.0.0): Executed 704 of 763 (4 FAILED) (0 secs / 10.023 secs)
HeadlessChrome 0.0.0 (Linux 0.0.0): Executed 705 of 763 (4 FAILED) (0 secs / 10.025 secs)
HeadlessChrome 0.0.0 (Linux 0.0.0): Executed 706 of 763 (4 FAILED) (0 secs / 10.026 secs)
HeadlessChrome 0.0.0 (Linux 0.0.0): Executed 707 of 763 (4 FAILED) (0 secs / 10.029 secs)
HeadlessChrome 0.0.0 (Linux 0.0.0): Executed 708 of 763 (4 FAILED) (0 secs / 10.031 secs)
HeadlessChrome 0.0.0 (Linux 0.0.0): Executed 709 of 763 (4 FAILED) (0 secs / 10.032 secs)
HeadlessChrome 0.0.0 (Linux 0.0.0): Executed 710 of 763 (4 FAILED) (0 secs / 10.033 secs)
HeadlessChrome 0.0.0 (Linux 0.0.0): Executed 711 of 763 (4 FAILED) (0 secs / 10.034 secs)
HeadlessChrome 0.0.0 (Linux 0.0.0): Executed 712 of 763 (4 FAILED) (0 secs / 10.036 secs)
HeadlessChrome 0.0.0 (Linux 0.0.0): Executed 713 of 763 (4 FAILED) (0 secs / 10.038 secs)
HeadlessChrome 0.0.0 (Linux 0.0.0): Executed 714 of 763 (4 FAILED) (0 secs / 10.061 secs)
HeadlessChrome 0.0.0 (Linux 0.0.0): Executed 715 of 763 (4 FAILED) (0 secs / 10.064 secs)
HeadlessChrome 0.0.0 (Linux 0.0.0): Executed 716 of 763 (4 FAILED) (0 secs / 10.086 secs)
HeadlessChrome 0.0.0 (Linux 0.0.0): Executed 717 of 763 (4 FAILED) (0 secs / 10.087 secs)
HeadlessChrome 0.0.0 (Linux 0.0.0): Executed 718 of 763 (4 FAILED) (0 secs / 10.091 secs)
HeadlessChrome 0.0.0 (Linux 0.0.0): Executed 719 of 763 (4 FAILED) (0 secs / 10.093 secs)
HeadlessChrome 0.0.0 (Linux 0.0.0): Executed 720 of 763 (4 FAILED) (0 secs / 10.096 secs)
HeadlessChrome 0.0.0 (Linux 0.0.0): Executed 721 of 763 (4 FAILED) (0 secs / 10.097 secs)
HeadlessChrome 0.0.0 (Linux 0.0.0): Executed 722 of 763 (4 FAILED) (0 secs / 10.099 secs)
HeadlessChrome 0.0.0 (Linux 0.0.0): Executed 723 of 763 (4 FAILED) (0 secs / 10.1 secs)
HeadlessChrome 0.0.0 (Linux 0.0.0): Executed 724 of 763 (4 FAILED) (0 secs / 10.102 secs)
HeadlessChrome 0.0.0 (Linux 0.0.0): Executed 725 of 763 (4 FAILED) (0 secs / 10.103 secs)
HeadlessChrome 0.0.0 (Linux 0.0.0): Executed 726 of 763 (4 FAILED) (0 secs / 10.105 secs)
HeadlessChrome 0.0.0 (Linux 0.0.0): Executed 727 of 763 (4 FAILED) (0 secs / 10.108 secs)
HeadlessChrome 0.0.0 (Linux 0.0.0): Executed 728 of 763 (4 FAILED) (0 secs / 10.109 secs)
HeadlessChrome 0.0.0 (Linux 0.0.0): Executed 729 of 763 (4 FAILED) (0 secs / 10.111 secs)
HeadlessChrome 0.0.0 (Linux 0.0.0): Executed 730 of 763 (4 FAILED) (0 secs / 10.112 secs)
HeadlessChrome 0.0.0 (Linux 0.0.0): Executed 731 of 763 (4 FAILED) (0 secs / 10.114 secs)
HeadlessChrome 0.0.0 (Linux 0.0.0): Executed 732 of 763 (4 FAILED) (0 secs / 10.115 secs)
HeadlessChrome 0.0.0 (Linux 0.0.0): Executed 733 of 763 (4 FAILED) (0 secs / 10.118 secs)
HeadlessChrome 0.0.0 (Linux 0.0.0): Executed 734 of 763 (4 FAILED) (0 secs / 10.122 secs)
HeadlessChrome 0.0.0 (Linux 0.0.0): Executed 735 of 763 (4 FAILED) (0 secs / 10.124 secs)
HeadlessChrome 0.0.0 (Linux 0.0.0): Executed 736 of 763 (4 FAILED) (0 secs / 10.125 secs)
HeadlessChrome 0.0.0 (Linux 0.0.0): Executed 737 of 763 (4 FAILED) (0 secs / 10.126 secs)
HeadlessChrome 0.0.0 (Linux 0.0.0): Executed 738 of 763 (4 FAILED) (0 secs / 10.127 secs)
HeadlessChrome 0.0.0 (Linux 0.0.0): Executed 739 of 763 (4 FAILED) (0 secs / 10.128 secs)
HeadlessChrome 0.0.0 (Linux 0.0.0): Executed 740 of 763 (4 FAILED) (0 secs / 10.13 secs)
HeadlessChrome 0.0.0 (Linux 0.0.0): Executed 741 of 763 (4 FAILED) (0 secs / 10.131 secs)
HeadlessChrome 0.0.0 (Linux 0.0.0): Executed 742 of 763 (4 FAILED) (0 secs / 10.134 secs)
HeadlessChrome 0.0.0 (Linux 0.0.0): Executed 743 of 763 (4 FAILED) (0 secs / 10.135 secs)
HeadlessChrome 0.0.0 (Linux 0.0.0): Executed 744 of 763 (4 FAILED) (0 secs / 10.137 secs)
HeadlessChrome 0.0.0 (Linux 0.0.0): Executed 745 of 763 (4 FAILED) (0 secs / 10.138 secs)
HeadlessChrome 0.0.0 (Linux 0.0.0): Executed 746 of 763 (4 FAILED) (0 secs / 10.14 secs)
HeadlessChrome 0.0.0 (Linux 0.0.0): Executed 747 of 763 (4 FAILED) (0 secs / 10.141 secs)
HeadlessChrome 0.0.0 (Linux 0.0.0): Executed 748 of 763 (4 FAILED) (0 secs / 10.143 secs)
HeadlessChrome 0.0.0 (Linux 0.0.0): Executed 749 of 763 (4 FAILED) (0 secs / 10.146 secs)
HeadlessChrome 0.0.0 (Linux 0.0.0): Executed 750 of 763 (4 FAILED) (0 secs / 10.147 secs)
HeadlessChrome 0.0.0 (Linux 0.0.0): Executed 751 of 763 (4 FAILED) (0 secs / 10.151 secs)
HeadlessChrome 0.0.0 (Linux 0.0.0): Executed 752 of 763 (4 FAILED) (0 secs / 10.16 secs)
HeadlessChrome 0.0.0 (Linux 0.0.0): Executed 753 of 763 (4 FAILED) (0 secs / 10.162 secs)
HeadlessChrome 0.0.0 (Linux 0.0.0): Executed 754 of 763 (4 FAILED) (0 secs / 10.164 secs)
HeadlessChrome 0.0.0 (Linux 0.0.0): Executed 755 of 763 (4 FAILED) (0 secs / 10.165 secs)
HeadlessChrome 0.0.0 (Linux 0.0.0): Executed 756 of 763 (4 FAILED) (0 secs / 10.167 secs)
HeadlessChrome 0.0.0 (Linux 0.0.0): Executed 757 of 763 (4 FAILED) (0 secs / 10.168 secs)
HeadlessChrome 0.0.0 (Linux 0.0.0): Executed 758 of 763 (4 FAILED) (0 secs / 10.168 secs)
HeadlessChrome 0.0.0 (Linux 0.0.0): Executed 759 of 763 (4 FAILED) (0 secs / 10.17 secs)
HeadlessChrome 0.0.0 (Linux 0.0.0): Executed 760 of 763 (4 FAILED) (0 secs / 10.172 secs)
HeadlessChrome 0.0.0 (Linux 0.0.0): Executed 761 of 763 (4 FAILED) (0 secs / 10.174 secs)
HeadlessChrome 0.0.0 (Linux 0.0.0): Executed 762 of 763 (4 FAILED) (0 secs / 10.175 secs)
HeadlessChrome 0.0.0 (Linux 0.0.0): Executed 763 of 763 (4 FAILED) (0 secs / 10.177 secs)
HeadlessChrome 0.0.0 (Linux 0.0.0): Executed 763 of 763 (4 FAILED) (10.544 secs / 10.177 secs)
ERROR: Error detected when running the Jasmine tests.
ERROR: Error detected when running the Jasmine tests.
Build step 'Execute shell' marked build as failure

Reply | Threaded
Open this post in threaded view
|

Jenkins build is back to normal : pgadmin4-master-python37 #97

pgAdmin 4 Jenkins